{"text_format":"1","workbook":"xlsx","n_sheets":18,"sheets":["Prvi_list","Podatki","Merilna_mesta","Metode","Meritve","Metode-sediment","Meritve-sediment","Metode-živi org.","Meritve-živi org.","Vrednotenje","Pooblastilo","Meje_vode","Sifrant","Parametri","param.kem.stanja","param.ekol.stanja","param.ekol.stanja fiz.-kem.","naravna_ozadja"],"not_rendered":{"charts":0,"images":6,"macros":1,"external_links":2,"defined_names":69,"comments":9,"pivot_tables":0},"unopened":[],"bounds":{"document_bytes":16777216,"sheet_cells":100000,"rows_first":2000,"rows_last":500,"rows_between":2000,"halvings":0,"cell_chars":16384,"cell_head_chars":4096},"cells_cut":0,"cells_raw":0,"read":"whole","date_system":"1900"}

{"sheet":"Prvi_list","index":0,"n_rows":21,"n_cols":1,"rows_kept":21,"cut":false,"hidden":false,"merged":[]}
["VERZIJA: 22.1.2026"]
[]
[]
[]
[]
[]
[]
[]
[]
[]
[]
[]
[]
[]
[]
{"$rows_left_out":7}
{"sheet":"Podatki","index":1,"n_rows":79,"n_cols":3,"rows_kept":79,"cut":false,"hidden":false,"merged":[[0,1,0,2]]}
[null,"POROČILO O OBRATOVALNEM MONITORINGU \nSTANJA POVRŠINSKIH VODA"]
[]
[null,"MERITVE ZA LETO",2025]
[]
[null,"PODATKI O ZAVEZANCU"]
[null,"Naziv zavezanca iz sodnega registra: "]
[null,"Naslov zavezanca"]
[null,"Naselje:"]
[null,"Ulica:"]
[null,"Hišna številka:"]
[null,"Poštna številka:"]
[null,"Ime pošte:"]
[null,"Občina:",""]
[null,"Matična številka zavezanca:"]
[null,"Identifikacijska številka za DDV:"]
{"$rows_left_out":65}
{"sheet":"Merilna_mesta","index":2,"n_rows":6,"n_cols":3,"rows_kept":6,"cut":false,"hidden":false,"merged":[]}
[null,"MERILNA MESTA"]
[null,"Opis merilnega mesta Gorvodno (A):","Fotografija struge na mestu vzorčenja:"]
[]
[]
[]
[null,"Opis merilnega mesta Dolvodno (B):","Fotografija struge na mestu vzorčenja:"]

{"sheet":"Metode","index":3,"n_rows":9,"n_cols":9,"rows_kept":9,"cut":false,"hidden":false,"merged":[[0,0,0,2],[1,0,1,7]]}
[]
["UPORABLJENE MERILNE METODE za površinske vode"]
["Zap. št.","Parameter (enota)","Meja zaznavnosti (LOD)","Meja določljivosti (LOQ)","Merilna metoda","Merilna negotovost","Merilna negotovost \n(v območju LOQ)","Akreditirana metoda","Ime podizvajalca"]
[1180,"Pretok (m3/s)"]
[1020,"Temperatura vode (°C)"]
[1060,"pH"]
[1071,"Električna prevodnost (25oC) (µS/cm)"]
[1090,"Nasičenost s kisikom (% O2)"]
[1080,"Kisik (mgO2/L)"]

{"sheet":"Meritve","index":4,"n_rows":23,"n_cols":31,"rows_kept":23,"cut":false,"hidden":false,"merged":[[8,21,8,30],[11,19,11,20],[11,21,11,22],[11,29,11,30],[10,7,10,30],[11,23,11,24],[11,25,11,26],[11,27,11,28],[11,17,11,18],[9,21,9,29],[6,21,6,30],[4,15,5,17],[4,9,4,14],[4,18,5,19],[5,9,5,10],[5,11,5,14],[6,9,6,10],[6,11,6,14],[6,15,6,17],[6,18,6,19],[5,21,5,30],[7,18,7,19],[11,7,11,8],[11,13,11,14],[10,4,11,6],[7,6,7,7],[7,9,7,10],[7,11,7,14],[11,9,11,10],[11,11,11,12],[7,4,7,5],[11,15,11,16],[7,15,7,17],[10,2,11,3],[0,4,0,7],[1,4,1,7],[4,4,4,7],[5,4,5,5],[5,6,5,7],[4,2,5,3],[6,2,6,3],[7,2,7,3],[6,4,6,5],[6,6,6,7],[3,0,3,7],[10,0,10,1],[11,0,12,0],[11,1,12,1],[4,0,5,0],[4,1,5,1],[1,21,1,31],[4,21,4,31],[3,21,3,31],[3,9,3,19],[2,21,2,31],[2,2,2,3]]}
["PODATKI O MERITVAH NA VODOTOKU (STANJE POVRŠINSKIH VODA)",null,null,null,"Naziv izvajalca monitoringa",null,null,null,null,null,null,null,null,null,null,null,null,null,null,null,null,"LEGENDA:"]
[null,null,null,null,{"$f":"IF(Podatki!C52=\"\",\"\",Podatki!C52)","v":""},null,null,null,null,null,null,null,null,null,null,null,null,null,null,null,null,"rumeno obarvani parametri: obremenitev spremeni razvrstitev ekološkega/kemijskega stanja (zaradi LP-OSK)"]
["TIP REKE:",null,"Poglej v GIS portalu",null,null,null,null,null,null,null,null,null,null,null,null,null,null,null,null,null,null,"rdeče obarvane celice: razlika letnih povprečnih vrednosti je enaka ali večja od LP-OSK = ZNATNO POVEČANJE"]
["MESTO VZORČENJA:",null,null,null,null,null,null,null,null,"STABILNE HIDROLOŠKE RAZMERE (predpisano merilo):",null,null,null,null,null,null,null,null,null,null,null,"oranžno obarvane celice: vrednost presega NDK-OSK"]
[null,"Oznaka","Vodotok",null,"Transverzalna (prečna) Marcatorjeva koordinata",null,null,null,null,"Merilna postaja",null,null,null,null,null,"Vodotok",null,null,"Srednji pretok",null,null,"rjavo obarvani parametri: obremenitev spremeni razvrstitev ekološkega/kemijskega stanja (zaradi NDK-OSK) = ZNATNO POVEČANJE"]
[null,null,null,null,"n",null,"e",null,null,"Šifra",null,"Ime",null,null,null,null,null,null,null,null,null,"-rezultat meritve pod LOD se zapiše kot npr. \"<0,1\" (če je LOD=0,1) "]
["Gorvodno (A)",null,null,null,null,null,null,null,null,null,null,{"$f":"IF(J7<>\"\",VLOOKUP(J7,Sifrant!$D$2:$F$742,3,FALSE),\"\")","v":""},null,null,null,{"$f":"IF(J7<>\"\",VLOOKUP(J7,Sifrant!$D$2:$E$741,2,FALSE),\"\")","v":""},null,null,null,null,null,"-rezultat meritve med LOD in LOQ se zapiše kot (LOQ)/2 in vrednost se podčrta (0,15 če je LOQ=0,3)"]
["Dolvodno (B)",null,null,null,null,null,null,null,null,null,null,{"$f":"IF(J8<>\"\",VLOOKUP(J8,Sifrant!$D$2:$F$742,3,FALSE),\"\")","v":""},null,null,null,{"$f":"IF(J8<>\"\",VLOOKUP(J8,Sifrant!$D$2:$E$741,2,FALSE),\"\")","v":""},null,null,null,null,null,"OPOMBA"]
[null,null,null,null,null,null,null,null,null,null,null,null,null,null,null,null,null,null,null,null,null,"Če se vrednost v tabeli obarva v rdečo pomeni, da gre za nepravilno vrednost, ki jo morate odpraviti."]
[null,null,null,null,null,null,null,null,null,null,null,null,null,null,null,null,null,null,null,null,null,"Če se vrednost v tabeli obarva v modro pomeni, da gre za vrednost 0 (nič)."]
["Parameter",null,"Mejna vrednost za \ndobro stanje vodotoka",null,"Povprečna letna vrednost",null,null,"Št. vzorčenja"]
["Zap. št. Parametra","Naziv parametra (enota)",null,null,null,null,null,1,null,2,null,3,null,4,null,5,null,6,null,7,null,8,null,9,null,10,null,11,null,12]
[null,null,"LP-OSK","NDK-OSK","Razlika \n(B) - (A)","Gorovodno (A)","Dolvodno (B)","A","B","A","B","A","B","A","B","A","B","A","B","A","B","A","B","A","B","A","B","A","B","A","B"]
["ID vzorca",null,"/","/","/","/","/"]
["datum vz. (dd.mm.ll)",null,"/","/","/","/","/"]
{"$rows_left_out":9}
{"sheet":"Metode-sediment","index":5,"n_rows":3,"n_cols":9,"rows_kept":3,"cut":false,"hidden":false,"merged":[[0,0,0,2],[1,0,1,7]]}
[]
["UPORABLJENE MERILNE METODE za sedimente"]
["Zap. št.","Parameter (enota)","Meja zaznavnosti (LOD)","Meja določljivosti (LOQ)","Merilna metoda","Merilna negotovost","Merilna negotovost \n(v območju LOQ)","Akreditirana metoda","Ime podizvajalca"]

{"sheet":"Meritve-sediment","index":6,"n_rows":16,"n_cols":22,"rows_kept":16,"cut":false,"hidden":false,"merged":[[7,2,7,3],[0,4,0,7],[1,4,1,7],[3,0,3,7],[3,9,3,19],[4,0,5,0],[4,1,5,1],[4,2,5,3],[4,4,4,7],[4,9,4,14],[9,21,9,30],[1,21,1,30],[10,2,10,3],[6,11,6,14],[6,15,6,17],[4,18,5,19],[4,21,4,30],[5,4,5,5],[5,6,5,7],[5,9,5,10],[5,11,5,14],[5,21,5,30],[4,15,5,17],[8,21,8,30],[6,18,6,19],[6,21,6,30],[10,0,10,1],[11,0,12,0],[11,1,12,1],[3,21,3,30],[2,21,2,30],[11,2,11,3],[7,4,7,5],[7,6,7,7],[7,9,7,10],[7,11,7,14],[7,15,7,17],[7,18,7,19],[6,2,6,3],[6,4,6,5],[6,6,6,7],[6,9,6,10]]}
["PODATKI O MERITVAH NA VODOTOKU (STANJE POVRŠINSKIH VODA)",null,null,null,"Naziv izvajalca monitoringa"]
[null,null,null,null,{"$f":"IF(Podatki!C52=\"\",\"\",Podatki!C52)","v":""}]
[]
["MESTO VZORČENJA:",null,null,null,null,null,null,null,null,"STABILNE HIDROLOŠKE RAZMERE (predpisano merilo):"]
[null,"Oznaka","Vodotok",null,"Transverzalna (prečna) Marcatorjeva koordinata",null,null,null,null,"Merilna postaja",null,null,null,null,null,"Vodotok",null,null,"Srednji pretok",null,null,"ZAPIS REZULTATOV MERITEV:"]
[null,null,null,null,"n",null,"e",null,null,"Šifra",null,"Ime",null,null,null,null,null,null,null,null,null,"-rezultat meritve pod LOD se zapiše kot npr. \"<0,1\" (če je LOD=0,1) "]
["Gorvodno (A)",null,null,null,null,null,null,null,null,null,null,{"$f":"IF(J7<>\"\",VLOOKUP(J7,Sifrant!$D$2:$F$742,3,FALSE),\"\")","v":""},null,null,null,{"$f":"IF(J7<>\"\",VLOOKUP(J7,Sifrant!$D$2:$E$741,2,FALSE),\"\")","v":""},null,null,null,null,null,"-rezultat meritve med LOD in LOQ se zapiše kot (LOQ)/2 in vrednost se podčrta (0,15 če je LOQ=0,3)"]
["Dolvodno (B)",null,null,null,null,null,null,null,null,null,null,{"$f":"IF(J8<>\"\",VLOOKUP(J8,Sifrant!$D$2:$F$742,3,FALSE),\"\")","v":""},null,null,null,{"$f":"IF(J8<>\"\",VLOOKUP(J8,Sifrant!$D$2:$E$741,2,FALSE),\"\")","v":""},null,null,null,null,null,"OPOMBA"]
[null,null,null,null,null,null,null,null,null,null,null,null,null,null,null,null,null,null,null,null,null,"Če se vrednost v tabeli obarva v rdečo pomeni, da gre za nepravilno vrednost, ki jo morate odpraviti."]
[null,null,null,null,null,null,null,null,null,null,null,null,null,null,null,null,null,null,null,null,null,"Če se vrednost v tabeli obarva v modro pomeni, da gre za vrednost 0 (nič)."]
["Parameter",null,"Št. vzorčenja"]
["Zap. št. Parametra","Naziv parametra (enota)",1]
[null,null,"Gorvodno (A)","Dolvodno (B)"]
[null,"ID vzorca"]
[null,"datum vz. (dd.mm.ll)"]
{"$rows_left_out":2}
{"sheet":"Metode-živi org.","index":7,"n_rows":3,"n_cols":9,"rows_kept":3,"cut":false,"hidden":false,"merged":[[0,0,0,2],[1,0,1,7]]}
[]
["UPORABLJENE MERILNE METODE za žive organizme"]
["Zap. št.","Parameter (enota)","Meja zaznavnosti (LOD)","Meja določljivosti (LOQ)","Merilna metoda","Merilna negotovost","Merilna negotovost \n(v območju LOQ)","Akreditirana metoda","Ime podizvajalca"]

{"sheet":"Meritve-živi org.","index":8,"n_rows":51,"n_cols":34,"rows_kept":51,"cut":false,"hidden":false,"merged":[[45,6,45,8],[45,9,45,11],[46,3,47,3],[46,4,46,5],[46,6,47,6],[46,7,46,8],[46,9,47,9],[46,10,46,11],[45,3,45,5],[41,0,41,1],[42,0,42,1],[45,2,46,2],[45,0,45,1],[46,0,47,0],[46,1,47,1],[39,0,39,1],[40,0,40,1],[30,0,30,1],[31,0,31,1],[34,0,35,0],[36,0,38,1],[36,2,37,3],[25,4,25,18],[25,19,25,33],[26,4,26,18],[26,19,26,33],[36,4,36,18],[36,19,36,33],[37,4,37,18],[37,19,37,33],[34,2,34,3],[35,2,35,3],[28,0,28,1],[29,0,29,1],[20,0,20,1],[23,0,24,0],[23,2,23,3],[24,2,24,3],[25,0,27,1],[25,2,26,3],[6,21,6,31],[19,0,19,1],[12,0,13,0],[12,2,12,3],[13,2,13,3],[14,0,16,1],[14,2,15,3],[14,19,14,33],[15,4,15,18],[15,19,15,33],[17,0,17,1],[18,0,18,1],[14,4,14,18],[8,21,8,30],[6,18,6,19],[7,2,7,3],[7,4,7,5],[7,6,7,7],[7,9,7,10],[7,11,7,14],[7,15,7,17],[6,4,6,5],[6,6,6,7],[6,9,6,10],[6,11,6,14],[6,15,6,17],[0,4,0,7],[1,4,1,7],[3,0,3,7],[3,9,3,19],[1,21,1,31],[2,21,2,31],[9,21,9,30],[4,0,5,0],[4,1,5,1],[4,2,5,3],[4,4,4,7],[4,9,4,14],[4,15,5,17],[4,18,5,19],[4,21,4,30],[5,4,5,5],[5,6,5,7],[5,9,5,10],[5,11,5,14],[5,21,5,31],[7,18,7,19],[6,2,6,3]]}
["PODATKI O MERITVAH ŽIVIH ORGANIZMOV",null,null,null,"Naziv izvajalca monitoringa",null,null,null,null,null,null,null,null,null,null,null,null,null,null,null,null,"LEGENDA:"]
[null,null,null,null,{"$f":"IF(Podatki!C52=\"\",\"\",Podatki!C52)","v":""},null,null,null,null,null,null,null,null,null,null,null,null,null,null,null,null,"rumeno obarvani parametri: obremenitev spremeni razvrstitev ekološkega/kemijskega stanja (zaradi OSK)"]
[null,null,null,null,null,null,null,null,null,null,null,null,null,null,null,null,null,null,null,null,null,"rdeče obarvane celice: razlika vrednosti je enaka ali večja od OSK = ZNATNO POVEČANJE"]
["MESTO VZORČENJA:",null,null,null,null,null,null,null,null,"STABILNE HIDROLOŠKE RAZMERE (predpisano merilo):"]
[null,"Oznaka","Vodotok",null,"Transverzalna (prečna) Marcatorjeva koordinata",null,null,null,null,"Merilna postaja",null,null,null,null,null,"Vodotok",null,null,"Srednji pretok",null,null,"ZAPIS REZULTATOV MERITEV:"]
[null,null,null,null,"n",null,"e",null,null,"Šifra",null,"Ime",null,null,null,null,null,null,null,null,null,"-rezultat meritve pod LOD se zapiše kot npr. \"<0,1\" (če je LOD=0,1) "]
["Gorvodno (A)",null,null,null,null,null,null,null,null,null,null,{"$f":"IF(J7<>\"\",VLOOKUP(J7,Sifrant!$D$2:$F$742,3,FALSE),\"\")","v":""},null,null,null,{"$f":"IF(J7<>\"\",VLOOKUP(J7,Sifrant!$D$2:$E$741,2,FALSE),\"\")","v":""},null,null,null,null,null,"-rezultat meritve med LOD in LOQ se zapiše kot (LOQ)/2 in vrednost se podčrta (0,15 če je LOQ=0,3)"]
["Dolvodno (B)",null,null,null,null,null,null,null,null,null,null,{"$f":"IF(J8<>\"\",VLOOKUP(J8,Sifrant!$D$2:$F$742,3,FALSE),\"\")","v":""},null,null,null,{"$f":"IF(J8<>\"\",VLOOKUP(J8,Sifrant!$D$2:$E$741,2,FALSE),\"\")","v":""},null,null,null,null,null,"OPOMBA"]
[null,null,null,null,null,null,null,null,null,null,null,null,null,null,null,null,null,null,null,null,null,"Če se vrednost v tabeli obarva v rdečo pomeni, da gre za nepravilno vrednost, ki jo morate odpraviti."]
[null,null,null,null,null,null,null,null,null,null,null,null,null,null,null,null,null,null,null,null,null,"Če se vrednost v tabeli obarva v modro pomeni, da gre za vrednost 0 (nič)."]
[]
[]
["1. vzorec","Vrsta organizma"]
[null,"Uporabljeno tkivo"]
["Parameter",null,"Povprečna vrednost",null,"Gorovodno (A)",null,null,null,null,null,null,null,null,null,null,null,null,null,null,"Dolvodno (B)"]
{"$rows_left_out":37}
{"sheet":"Vrednotenje","index":9,"n_rows":17,"n_cols":1,"rows_kept":17,"cut":false,"hidden":false,"merged":[]}
["VREDNOTENJE"]
["Avtomatska kontrola podatkov je na podlagi 11. in 12. člena Pravilnika o obratovalnem monitoringu stanja površinskih voda ugotovila, da naprava čezmerno obremenjuje okolje ker:"]
["-na podlagi vrednotenja LP-OSK za površinsko vodo povzroča znatno povečanje vsebnosti sledečih parametrov:"]
[]
[]
["-na podlagi vrednotenja NDK-OSK za površinsko vodo povzroča znatno povečanje vsebnosti sledečih parametrov:"]
[]
[]
["-na podlagi vrednotenja OSK za žive organizme povzroča znatno povečanje vsebnosti sledečih parametrov:"]
[]
[""]
[]
[]
["POGOSTOST VZORČENJA"]
[]
{"$rows_left_out":3}
{"sheet":"Pooblastilo","index":10,"n_rows":1,"n_cols":1,"rows_kept":1,"cut":false,"hidden":false,"merged":[[1,0,2,0]]}
["POOBLASTILO"]

{"sheet":"Meje_vode","index":11,"n_rows":94,"n_cols":13,"rows_kept":94,"cut":false,"hidden":false,"merged":[]}
["ID parametra","Parameter","Enota","LP-OSK (dobro)","NDK-OSK","LP-OSK (zelo dobro)",null,null,null,"ID parametra","Parameter","Enota","OSK organizmi"]
[8435,"1,2,4 Trimetilbenzen","µg/L",2,20,0.2,null,null,null,7136,"Benzo(a)piren-org. (mokra teža)","µg/kg",5]
[8090,"1,2-Dikloroetan","µg/L",10,"ni relevantno",null,null,null,null,91248,"Bromirani difenileter-org. (mokra teža)","µg/kg",8.5000000000000006E-2]
[8440,"1,3,5-Trimetilbenzen","µg/L",2,20,0.2,null,null,null,6038,"Dikofol-org. (mokra teža)","µg/kg",33]
[8250,"Adsorbljivi organski halogeni (AOX)","µg/L",20,"ni relevantno",2,null,null,null,90112,"Dioksini in dioksinom podobne spojine-org. (mokra teža)","µg/kg",6.4999999999999997E-3]
[6945,"Aklonifen","µg/L",0.12,0.12,null,null,null,null,7076,"Fluoranten-org. (mokra teža)","µg/kg",30]
[6010,"Alaklor","µg/L",0.3,0.7,null,null,null,null,8912,"HBCDD-org. (mokra teža)","µg/kg",167]
[3022,"Anionaktivni detergenti","µg/L",250,2500,25,null,null,null,6161,"Heksaklorobenzen-org. (mokra teža)","µg/kg",10]
[4020,"Antimon-filt.","µg/L",3.8,30.6,0.6,null,null,null,6171,"Heksaklorobutadien-org. (mokra teža)","µg/kg",55]
[7060,"Antracen","µg/L",0.1,0.1,null,null,null,null,94407,"Heptaklor in heptaklor epoksid-org. (mokra teža)","µg/kg",6.7000000000000002E-3]
[4030,"Arzen-filt.","µg/L",7,21,0.7,null,null,null,8902,"PFOS-org. (mokra teža)","µg/kg",9.1]
[6210,"Atrazin","µg/L",0.6,2,null,null,null,null,4365,"Živo srebro-org. (mokra teža)","µg/kg",20]
[4040,"Baker-filt.","µg/L",9.1999999999999993,74,1]
[8190,"Benzen","µg/L",10,50]
[7130,"Benzo(a)piren","µg/L",1.7000000000000001E-4,0.27]
{"$rows_left_out":80}
{"sheet":"Sifrant","index":12,"n_rows":1646,"n_cols":18,"rows_kept":1646,"cut":false,"hidden":true,"merged":[]}
["ID občine","Ime občine",null,"ID postaje","Vodotok","Ime postaje",null,"Šifra","Opis",null,null,null,"Naziv izvajalca OM","Ulica","Hišna številka","Poštna številka ","Ime pošte","Davčna številka"]
[null,null,null,null,null,null,null,null,null,null,"DA"]
[1,"Ajdovščina",null,1020,"Mura","Cmurek",null,"01","Kmetijska proizvodnja in lov ter z njima povezane storitve",null,"NE",null,"Bioinstitut","Rudolfa Steinerja",7,4000,"Čakovec",68643934]
[213,"Ankaran",null,1030,"Mura - kanal Vizjak","Vizjakov kanal",null,"011","Pridelovanje netrajnih rastlin",null,null,null,"Euroinspekt Croatiakontrola","Karlovačka cesta","4L",10000,"Zagreb"]
[195,"Apače",null,1040,"Mlinski potok","11 Mlinski kanal",null,"0111","Pridelovanje žit (razen riža), stročnic in oljnic",null,null,null,"Eurofins ERICo Slovenija","Koroška cesta",58,3320,"Velenje",63543877]
[2,"Beltinci",null,1050,"Mura","Črnci",null,"01110","Pridelovanje žit (razen riža), stročnic in oljnic",null,null,null,"Institut Jožef Štefan","Jamova cesta",39,1000,"Ljubljana",55560822]
[148,"Benedikt",null,1058,"Mura","Gornja Radgona",null,"0112","Pridelovanje riža",null,null,null,"Nacionalni inštitut za biologijo","Večna pot",111,1000,"Ljubljana",83534784]
[149,"Bistrica ob Sotli",null,1060,"Mura","Gornja Radgona I",null,"01120","Pridelovanje riža",null,null,null,"NLZOH","Prvomajska ulica",1,2000,"Maribor",19651295]
[3,"Bled",null,1070,"Mura","Petanjci",null,"0113","Pridelovanje zelenjadnic in melon, korenovk in gomoljnic",null,null,null,"Univerza v Ljubljani, Biotehniška fakulteta","Jamnikarjeva ",101,1000,"Ljubljana",94761795]
[150,"Bloke",null,1080,"Mura","Veržej",null,"01130","Pridelovanje zelenjadnic in melon, korenovk in gomoljnic",null,null,null,"Zavod za ribištvo Slovenije","Spodnje Gameljne","61A",1211,"Ljubljana-Šmartno",83921419]
[4,"Bohinj",null,1089,"Mura","Mursko Središče",null,"0114","Pridelovanje sladkornega trsa"]
[5,"Borovnica",null,1090,"Mura","Petišovci",null,"01140","Pridelovanje sladkornega trsa"]
[6,"Bovec",null,1100,"Kučnica","Cankova",null,"0115","Pridelovanje tobaka"]
[151,"Braslovče",null,1110,"Ščavnica","Zgornja Ščavnica",null,"01150","Pridelovanje tobaka"]
[7,"Brda",null,1120,"Ščavnica","Ivanjševci",null,"0116","Pridelovanje rastlin za vlakna"]
{"$rows_left_out":1632}
{"sheet":"Parametri","index":13,"n_rows":473,"n_cols":5,"rows_kept":473,"cut":false,"hidden":true,"merged":[]}
["IDParameter","ImeParametra","Enota","Opisni parametri","Parameter kemijskega stanja"]
[8140,"1,1,1-trikloroetan","µg/l"]
[8160,"1,1,2,2-Tetrakloroetan","µg/l"]
[8150,"1,1,2-Trikloroetan","µg/l"]
[8080,"1,1-Dikloroetan","µg/l"]
[8100,"1,1-Dikloroeten","µg/l"]
[90077,"1,2,3,4,6,7,8,9-OCDD","µg/L"]
[90078,"1,2,3,4,6,7,8,9-OCDF","µg/L"]
[90079,"1,2,3,4,6,7,8-HpCDD","µg/L"]
[90080,"1,2,3,4,6,7,8-HpCDF","µg/L"]
[90081,"1,2,3,4,7,8,9-HpCDF","µg/L"]
[90082,"1,2,3,4,7,8-HxCDD","µg/L"]
[90083,"1,2,3,4,7,8-HxCDF","µg/L"]
[90084,"1,2,3,6,7,8-HxCDD","µg/L"]
[90085,"1,2,3,6,7,8-HxCDF","µg/L"]
{"$rows_left_out":459}
{"sheet":"param.kem.stanja","index":14,"n_rows":89,"n_cols":8,"rows_kept":89,"cut":false,"hidden":false,"merged":[[26,0,27,0],[46,0,51,0],[13,7,17,7],[22,0,25,0],[22,3,25,3],[22,4,25,4],[22,5,25,5],[22,6,25,6],[22,7,25,7],[13,4,17,4],[6,0,7,0],[6,1,7,1],[13,0,17,0],[13,1,17,1],[13,2,17,2]]}
["Tabela 1:","Okoljski standardi kakovosti za parametre kemijskega stanja v vodi in organizmih"]
["OSK: Okoljski standard kakovosti"]
["LP: Letno povprečje "]
["NDK: Največja dovoljena koncentracija "]
["NO - vrednost naravnega ozadja; za vodotoke in jezera znaša za kadmij 0,04 µg/L in za živo srebro 0,0025 µg/L"]
[]
["Št.","Ime snovi","Številka ","LP-OSK (2) Celinske površinske vode (3)","LP-OSK (2) Druge površinske vode","NDK-OSK (4) Celinske površinske vode (3)","NDK-OSK (4) Druge površinske vode","OSK organizmi (12)"]
[null,null,"CAS (1)","Enota: µg/L","Enota: µg/L","Enota: µg/L","Enota: µg/L","Enota: µg/kg mokre teže"]
[-1,"alaklor","15972-60-8",0.3,0.3,0.7,0.7]
[-2,"antracen","120-12-7",0.1,0.1,0.1,0.1]
[-3,"atrazin","1912-24-9",0.6,0.6,2,2]
[-4,"benzen","71-43-2",10,8,50,50]
[-5,"bromirani difeniletri (5)","32534-81-9",null,null,0.14000000000000001,1.4E-2,8.5000000000000006E-3]
[-6,"kadmij in njegove spojine (glede na razrede trdote vode) (6)","7440-43-9","r.1: ≤ 0,08 + NO","0,2 + NO","r.1: ≤ 0,45 + NO","r.1: ≤ 0,45 + NO"]
[null,null,null,"r.2: 0,08 + NO",null,"r.2: 0,45 +NO","r.2: 0,45 + NO"]
{"$rows_left_out":75}
{"sheet":"param.ekol.stanja","index":15,"n_rows":59,"n_cols":8,"rows_kept":59,"cut":false,"hidden":false,"merged":[[31,7,33,7],[39,0,39,6],[2,4,2,6],[3,5,3,6],[5,0,5,6],[19,0,19,6],[27,0,27,6],[31,0,33,0],[31,1,33,1],[31,2,33,2],[31,3,33,3]]}
["Tabela 2:","Mejne vrednosti razredov ekološkega stanja za posebna onesnaževala in naravno ozadje za kovine in njihove spojine"]
[]
[null,null,null,null,"Mejne vrednosti "]
[null,null,null,null,"ZELO DOBRO ","DOBRO "]
["Št.","Ime parametra","Številka CAS","Enota","LP-OSK","LP-OSK","NDK-OSK","NO"]
["Sintetična onesnaževala"]
[1,"1,2,4-trimetilbenzen","95-63-6","µg/L",0.2,2,20,"-"]
[2,"1,3,5-trimetilbenzen","108-67-8","µg/L",0.2,2,20,"-"]
[3,"bisfenol-A","80-05-7","µg/L",0.16,1.6,16,"-"]
[4,"klorotoluron (+ desmetil klorotoluron)","15545-48-9","µg/L",0.08,0.8,8,"-"]
[5,"cianid (prosti) a","57-12-5","µg/L",1,1.2,17,"-"]
[6,"dibutilftalat","84-74-2","µg/L",1,10,100,"-"]
[7,"dibutilkositrov kation","ni določena","µg/L",2E-3,0.02,0.21,"-"]
[8,"epiklorhidrin","106-89-8","µg/L",1.2,12,120,"-"]
[9,"fluorid","16984-48-8","µg/L",68,680,6800,"-"]
{"$rows_left_out":45}
{"sheet":"param.ekol.stanja fiz.-kem.","index":16,"n_rows":77,"n_cols":20,"rows_kept":77,"cut":false,"hidden":false,"merged":[]}
["Tabela 3:","Mejne vrednosti razredov ekološkega stanja za splošne fizikalno-kemijske parametre za reke"]
[]
["Tip reke","Saprobni tip","BPK5 tip","RV","ZD/D","D/Z","Nitratni tip","RV","ZD/D","D/Z",null,"BPK5 tip","RV (mg/l)","ZD/D (mg/l)","D/Z (mg/l)",null,"NO3 tip","RV (mg/l)","ZD/D (mg/l)","D/Z (mg/l)"]
["ni določen",null,null,null,null,null,null,null,null,null,null,1,"<1,0",1.6,2.1,null,1,2,3.2,6.5]
["R_SI_3_Vip-Brda_1","SI1.30",2,1.2,1.9,4.4000000000000004,1,2,3.2,6.5,null,2,1.2,1.9,4.4000000000000004,null,2,3.4,5,7.7]
["R_SI_3_Vip-Brda_2","SI1.60",2,1.2,1.9,4.4000000000000004,3,5.0999999999999996,7,9.5,null,3,1.4,2.4,5.4,null,3,5.0999999999999996,7,9.5]
["R_SI_4_KB-AL-D_1","SI1.30",2,1.2,1.9,4.4000000000000004,1,2,3.2,6.5]
["R_SI_4_KB-AL-D_1_>700","SI1.25",1,"<1,0",1.6,2.1,1,2,3.2,6.5]
["R_SI_4_KB-AL-D_1_KI","SI1.30",2,1.2,1.9,4.4000000000000004,2,3.4,5,7.7]
["R_SI_4_KB-AL-D_1_LI","SI1.30",2,1.2,1.9,4.4000000000000004,1,2,3.2,6.5]
["R_SI_4_KB-AL-D_1_Pres","SI1.20",1,"<1,0",1.6,2.1,1,2,3.2,6.5]
["R_SI_4_KB-AL-D_2","SI1.35",2,1.2,1.9,4.4000000000000004,1,2,3.2,6.5]
["R_SI_4_KB-AL-D_2_IiJ","SI1.70",2,1.2,1.9,4.4000000000000004,1,2,3.2,6.5]
["R_SI_4_KB-AL-D_2_KI","SI1.30",2,1.2,1.9,4.4000000000000004,2,3.4,5,7.7]
["R_SI_4_KB-AL-J_1","SI1.30",2,1.2,1.9,4.4000000000000004,1,2,3.2,6.5]
{"$rows_left_out":63}
{"sheet":"naravna_ozadja","index":17,"n_rows":12,"n_cols":5,"rows_kept":12,"cut":false,"hidden":false,"merged":[]}
["Tabela 4:","Naravna ozadja za kovine in njihove spojine"]
[]
[null,"Ime parametra","Številka CAS","Enota","Vrednost naravnega  ozadja za celinske vode"]
[null,"Prednostne in prednostne nevarne snovi"]
[null,"kadmij in njegove spojine","7440-43-9","µg/L",0.04]
[null,"živo srebro in njegove spojine","7439-97-6","µg/L",2.5000000000000001E-3]
[null,"Posebna onesnaževala"]
[null,"baker in njegove spojine","7440-58-8","µg/L",1]
[null,"bor in njegove spojine","7440-42-8","µg/L",30]
[null,"cink in njegove spojine","7440-66-6","µg/L",4.2]
[null,"kobalt in njegove spojine","7440-48-4","µg/L",0.1]
[null,"antimon in njegove spojine","7440-36-0","µg/L",0.6]