{"text_format":"1","workbook":"xlsx","n_sheets":2,"sheets":["Obrazec preveritev in poročanje","Kode"],"not_rendered":{"charts":0,"images":0,"macros":1,"external_links":0,"defined_names":0,"comments":1,"pivot_tables":0},"unopened":[],"bounds":{"document_bytes":16777216,"sheet_cells":100000,"rows_first":2000,"rows_last":500,"rows_between":2000,"halvings":0,"cell_chars":16384,"cell_head_chars":4096},"cells_cut":0,"cells_raw":0,"read":"whole","date_system":"1900"}

{"sheet":"Obrazec preveritev in poročanje","index":0,"n_rows":205,"n_cols":24,"rows_kept":205,"cut":false,"hidden":false,"merged":[]}
["Naziv dajalca pomoči","Matična številka dajalca pomoči","Številka priglasitve","Naziv sheme pomoči de minimis ali individualne ad hoc pomoči de minimis","Matična številka prejemnika","Ime in priimek prejemnika ali naziv pravne osebe, ki je prejela pomoč","Davčna št.  prejemnika","KMG-MID-številka prejemnika","Naslov prejemnika (ime ulice in hišna številka, poštna številka in naziv pošte)","Šifra občine prejemnika","Datum odobritve pomoči","Datum nakazila pomoči prejemniku","Šifra instrumenta pomoči","Šifra namena pomoči","Opis ukrepa","Naložba\n(da/ne)","Vrednost celotne naložbe (EUR)","Pravna podlaga za odobritev pomoči","Pravni akt","Znesek upravičenih stroškov (EUR)","Bruto znesek pomoči \n(EUR)","Neto znesek \npomoči (EUR)","Število udeležencev","Stopnja intenzivnosti pomoči (%)"]
[{"$f":"VLOOKUP(C2,Kode!A2:C219,2,FALSE)","v":{"$error":"#N/A"}},{"$f":"VLOOKUP(C2,Kode!A2:C219,3,FALSE)","v":{"$error":"#N/A"}},null,{"$f":"VLOOKUP(C2,Kode!A2:D219,4,FALSE)","v":{"$error":"#N/A"}},null,null,null,null,null,null,null,null,null,null,null,null,null,{"$f":"VLOOKUP(C2,Kode!A2:E219,5,FALSE)","v":{"$error":"#N/A"}},null,null,null,null,null,{"$f":"V2/T2*100","v":{"$error":"#DIV/0!"}}]
[{"$f":"VLOOKUP(C3,Kode!A2:C219,2,FALSE)","v":{"$error":"#N/A"}},{"$f":"VLOOKUP(C3,Kode!A2:C219,3,FALSE)","v":{"$error":"#N/A"}},null,{"$f":"VLOOKUP(C3,Kode!A2:D219,4,FALSE)","v":{"$error":"#N/A"}},null,null,null,null,null,null,null,null,null,null,null,null,null,{"$f":"VLOOKUP(C3,Kode!A2:E219,5,FALSE)","v":{"$error":"#N/A"}},null,null,null,null,null,{"$f":"V3/T3*100","v":{"$error":"#DIV/0!"}}]
[{"$f":"VLOOKUP(C4,Kode!A2:C219,2,FALSE)","v":{"$error":"#N/A"}},{"$f":"VLOOKUP(C4,Kode!A2:C219,3,FALSE)","v":{"$error":"#N/A"}},null,{"$f":"VLOOKUP(C4,Kode!A2:D219,4,FALSE)","v":{"$error":"#N/A"}},null,null,null,null,null,null,null,null,null,null,null,null,null,{"$f":"VLOOKUP(C4,Kode!A2:E219,5,FALSE)","v":{"$error":"#N/A"}},null,null,null,null,null,{"$error":"#DIV/0!"}]
[{"$f":"VLOOKUP(C5,Kode!A2:C219,2,FALSE)","v":{"$error":"#N/A"}},{"$f":"VLOOKUP(C5,Kode!A2:C219,3,FALSE)","v":{"$error":"#N/A"}},null,{"$f":"VLOOKUP(C5,Kode!A2:D219,4,FALSE)","v":{"$error":"#N/A"}},null,null,null,null,null,null,null,null,null,null,null,null,null,{"$f":"VLOOKUP(C5,Kode!A2:E219,5,FALSE)","v":{"$error":"#N/A"}},null,null,null,null,null,{"$error":"#DIV/0!"}]
[{"$f":"VLOOKUP(C6,Kode!A2:C219,2,FALSE)","v":{"$error":"#N/A"}},{"$f":"VLOOKUP(C6,Kode!A2:C219,3,FALSE)","v":{"$error":"#N/A"}},null,{"$f":"VLOOKUP(C6,Kode!A2:D219,4,FALSE)","v":{"$error":"#N/A"}},null,null,null,null,null,null,null,null,null,null,null,null,null,{"$f":"VLOOKUP(C6,Kode!A2:E219,5,FALSE)","v":{"$error":"#N/A"}},null,null,null,null,null,{"$error":"#DIV/0!"}]
[{"$f":"VLOOKUP(C7,Kode!A2:C219,2,FALSE)","v":{"$error":"#N/A"}},{"$f":"VLOOKUP(C7,Kode!A2:C219,3,FALSE)","v":{"$error":"#N/A"}},null,{"$f":"VLOOKUP(C7,Kode!A2:D219,4,FALSE)","v":{"$error":"#N/A"}},null,null,null,null,null,null,null,null,null,null,null,null,null,{"$f":"VLOOKUP(C7,Kode!A2:E219,5,FALSE)","v":{"$error":"#N/A"}},null,null,null,null,null,{"$error":"#DIV/0!"}]
[{"$f":"VLOOKUP(C8,Kode!A2:C219,2,FALSE)","v":{"$error":"#N/A"}},{"$f":"VLOOKUP(C8,Kode!A2:C219,3,FALSE)","v":{"$error":"#N/A"}},null,{"$f":"VLOOKUP(C8,Kode!A2:D219,4,FALSE)","v":{"$error":"#N/A"}},null,null,null,null,null,null,null,null,null,null,null,null,null,{"$f":"VLOOKUP(C8,Kode!A2:E219,5,FALSE)","v":{"$error":"#N/A"}},null,null,null,null,null,{"$error":"#DIV/0!"}]
[{"$f":"VLOOKUP(C9,Kode!A2:C219,2,FALSE)","v":{"$error":"#N/A"}},{"$f":"VLOOKUP(C9,Kode!A2:C219,3,FALSE)","v":{"$error":"#N/A"}},null,{"$f":"VLOOKUP(C9,Kode!A2:D219,4,FALSE)","v":{"$error":"#N/A"}},null,null,null,null,null,null,null,null,null,null,null,null,null,{"$f":"VLOOKUP(C9,Kode!A2:E219,5,FALSE)","v":{"$error":"#N/A"}},null,null,null,null,null,{"$error":"#DIV/0!"}]
[{"$f":"VLOOKUP(C10,Kode!A2:C219,2,FALSE)","v":{"$error":"#N/A"}},{"$f":"VLOOKUP(C10,Kode!A2:C219,3,FALSE)","v":{"$error":"#N/A"}},null,{"$f":"VLOOKUP(C10,Kode!A2:D219,4,FALSE)","v":{"$error":"#N/A"}},null,null,null,null,null,null,null,null,null,null,null,null,null,{"$f":"VLOOKUP(C10,Kode!A2:E219,5,FALSE)","v":{"$error":"#N/A"}},null,null,null,null,null,{"$error":"#DIV/0!"}]
[{"$f":"VLOOKUP(C11,Kode!A2:C219,2,FALSE)","v":{"$error":"#N/A"}},{"$f":"VLOOKUP(C11,Kode!A2:C219,3,FALSE)","v":{"$error":"#N/A"}},null,{"$f":"VLOOKUP(C11,Kode!A2:D219,4,FALSE)","v":{"$error":"#N/A"}},null,null,null,null,null,null,null,null,null,null,null,null,null,{"$f":"VLOOKUP(C11,Kode!A2:E219,5,FALSE)","v":{"$error":"#N/A"}},null,null,null,null,null,{"$error":"#DIV/0!"}]
[{"$f":"VLOOKUP(C12,Kode!A2:C219,2,FALSE)","v":{"$error":"#N/A"}},{"$f":"VLOOKUP(C12,Kode!A2:C219,3,FALSE)","v":{"$error":"#N/A"}},null,{"$f":"VLOOKUP(C12,Kode!A2:D219,4,FALSE)","v":{"$error":"#N/A"}},null,null,null,null,null,null,null,null,null,null,null,null,null,{"$f":"VLOOKUP(C12,Kode!A2:E219,5,FALSE)","v":{"$error":"#N/A"}},null,null,null,null,null,{"$error":"#DIV/0!"}]
[{"$f":"VLOOKUP(C13,Kode!A2:C219,2,FALSE)","v":{"$error":"#N/A"}},{"$f":"VLOOKUP(C13,Kode!A2:C219,3,FALSE)","v":{"$error":"#N/A"}},null,{"$f":"VLOOKUP(C13,Kode!A2:D219,4,FALSE)","v":{"$error":"#N/A"}},null,null,null,null,null,null,null,null,null,null,null,null,null,{"$f":"VLOOKUP(C13,Kode!A2:E219,5,FALSE)","v":{"$error":"#N/A"}},null,null,null,null,null,{"$error":"#DIV/0!"}]
[{"$f":"VLOOKUP(C14,Kode!A2:C219,2,FALSE)","v":{"$error":"#N/A"}},{"$f":"VLOOKUP(C14,Kode!A2:C219,3,FALSE)","v":{"$error":"#N/A"}},null,{"$f":"VLOOKUP(C14,Kode!A2:D219,4,FALSE)","v":{"$error":"#N/A"}},null,null,null,null,null,null,null,null,null,null,null,null,null,{"$f":"VLOOKUP(C14,Kode!A2:E219,5,FALSE)","v":{"$error":"#N/A"}},null,null,null,null,null,{"$error":"#DIV/0!"}]
[{"$f":"VLOOKUP(C15,Kode!A2:C219,2,FALSE)","v":{"$error":"#N/A"}},{"$f":"VLOOKUP(C15,Kode!A2:C219,3,FALSE)","v":{"$error":"#N/A"}},null,{"$f":"VLOOKUP(C15,Kode!A2:D219,4,FALSE)","v":{"$error":"#N/A"}},null,null,null,null,null,null,null,null,null,null,null,null,null,{"$f":"VLOOKUP(C15,Kode!A2:E219,5,FALSE)","v":{"$error":"#N/A"}},null,null,null,null,null,{"$error":"#DIV/0!"}]
[{"$f":"VLOOKUP(C16,Kode!A2:C219,2,FALSE)","v":{"$error":"#N/A"}},{"$f":"VLOOKUP(C16,Kode!A2:C219,3,FALSE)","v":{"$error":"#N/A"}},null,{"$f":"VLOOKUP(C16,Kode!A2:D219,4,FALSE)","v":{"$error":"#N/A"}},null,null,null,null,null,null,null,null,null,null,null,null,null,{"$f":"VLOOKUP(C16,Kode!A2:E219,5,FALSE)","v":{"$error":"#N/A"}},null,null,null,null,null,{"$error":"#DIV/0!"}]
[{"$f":"VLOOKUP(C17,Kode!A2:C219,2,FALSE)","v":{"$error":"#N/A"}},{"$f":"VLOOKUP(C17,Kode!A2:C219,3,FALSE)","v":{"$error":"#N/A"}},null,{"$f":"VLOOKUP(C17,Kode!A2:D219,4,FALSE)","v":{"$error":"#N/A"}},null,null,null,null,null,null,null,null,null,null,null,null,null,{"$f":"VLOOKUP(C17,Kode!A2:E219,5,FALSE)","v":{"$error":"#N/A"}},null,null,null,null,null,{"$error":"#DIV/0!"}]
[{"$f":"VLOOKUP(C18,Kode!A2:C219,2,FALSE)","v":{"$error":"#N/A"}},{"$f":"VLOOKUP(C18,Kode!A2:C219,3,FALSE)","v":{"$error":"#N/A"}},null,{"$f":"VLOOKUP(C18,Kode!A2:D219,4,FALSE)","v":{"$error":"#N/A"}},null,null,null,null,null,null,null,null,null,null,null,null,null,{"$f":"VLOOKUP(C18,Kode!A2:E219,5,FALSE)","v":{"$error":"#N/A"}},null,null,null,null,null,{"$error":"#DIV/0!"}]
[{"$f":"VLOOKUP(C19,Kode!A2:C219,2,FALSE)","v":{"$error":"#N/A"}},{"$f":"VLOOKUP(C19,Kode!A2:C219,3,FALSE)","v":{"$error":"#N/A"}},null,{"$f":"VLOOKUP(C19,Kode!A2:D219,4,FALSE)","v":{"$error":"#N/A"}},null,null,null,null,null,null,null,null,null,null,null,null,null,{"$f":"VLOOKUP(C19,Kode!A2:E219,5,FALSE)","v":{"$error":"#N/A"}},null,null,null,null,null,{"$error":"#DIV/0!"}]
[{"$f":"VLOOKUP(C20,Kode!A2:C219,2,FALSE)","v":{"$error":"#N/A"}},{"$f":"VLOOKUP(C20,Kode!A2:C219,3,FALSE)","v":{"$error":"#N/A"}},null,{"$f":"VLOOKUP(C20,Kode!A2:D219,4,FALSE)","v":{"$error":"#N/A"}},null,null,null,null,null,null,null,null,null,null,null,null,null,{"$f":"VLOOKUP(C20,Kode!A2:E219,5,FALSE)","v":{"$error":"#N/A"}},null,null,null,null,null,{"$error":"#DIV/0!"}]
[{"$f":"VLOOKUP(C21,Kode!A2:C219,2,FALSE)","v":{"$error":"#N/A"}},{"$f":"VLOOKUP(C21,Kode!A2:C219,3,FALSE)","v":{"$error":"#N/A"}},null,{"$f":"VLOOKUP(C21,Kode!A2:D219,4,FALSE)","v":{"$error":"#N/A"}},null,null,null,null,null,null,null,null,null,null,null,null,null,{"$f":"VLOOKUP(C21,Kode!A2:E219,5,FALSE)","v":{"$error":"#N/A"}},null,null,null,null,null,{"$error":"#DIV/0!"}]
[{"$f":"VLOOKUP(C22,Kode!A2:C219,2,FALSE)","v":{"$error":"#N/A"}},{"$f":"VLOOKUP(C22,Kode!A2:C219,3,FALSE)","v":{"$error":"#N/A"}},null,{"$f":"VLOOKUP(C22,Kode!A2:D219,4,FALSE)","v":{"$error":"#N/A"}},null,null,null,null,null,null,null,null,null,null,null,null,null,{"$f":"VLOOKUP(C22,Kode!A2:E219,5,FALSE)","v":{"$error":"#N/A"}},null,null,null,null,null,{"$error":"#DIV/0!"}]
[{"$f":"VLOOKUP(C23,Kode!A2:C219,2,FALSE)","v":{"$error":"#N/A"}},{"$f":"VLOOKUP(C23,Kode!A2:C219,3,FALSE)","v":{"$error":"#N/A"}},null,{"$f":"VLOOKUP(C23,Kode!A2:D219,4,FALSE)","v":{"$error":"#N/A"}},null,null,null,null,null,null,null,null,null,null,null,null,null,{"$f":"VLOOKUP(C23,Kode!A2:E219,5,FALSE)","v":{"$error":"#N/A"}},null,null,null,null,null,{"$error":"#DIV/0!"}]
[{"$f":"VLOOKUP(C24,Kode!A2:C219,2,FALSE)","v":{"$error":"#N/A"}},{"$f":"VLOOKUP(C24,Kode!A2:C219,3,FALSE)","v":{"$error":"#N/A"}},null,{"$f":"VLOOKUP(C24,Kode!A2:D219,4,FALSE)","v":{"$error":"#N/A"}},null,null,null,null,null,null,null,null,null,null,null,null,null,{"$f":"VLOOKUP(C24,Kode!A2:E219,5,FALSE)","v":{"$error":"#N/A"}},null,null,null,null,null,{"$error":"#DIV/0!"}]
[{"$f":"VLOOKUP(C25,Kode!A2:C219,2,FALSE)","v":{"$error":"#N/A"}},{"$f":"VLOOKUP(C25,Kode!A2:C219,3,FALSE)","v":{"$error":"#N/A"}},null,{"$f":"VLOOKUP(C25,Kode!A2:D219,4,FALSE)","v":{"$error":"#N/A"}},null,null,null,null,null,null,null,null,null,null,null,null,null,{"$f":"VLOOKUP(C25,Kode!A2:E219,5,FALSE)","v":{"$error":"#N/A"}},null,null,null,null,null,{"$error":"#DIV/0!"}]
[{"$f":"VLOOKUP(C26,Kode!A2:C219,2,FALSE)","v":{"$error":"#N/A"}},{"$f":"VLOOKUP(C26,Kode!A2:C219,3,FALSE)","v":{"$error":"#N/A"}},null,{"$f":"VLOOKUP(C26,Kode!A2:D219,4,FALSE)","v":{"$error":"#N/A"}},null,null,null,null,null,null,null,null,null,null,null,null,null,{"$f":"VLOOKUP(C26,Kode!A2:E219,5,FALSE)","v":{"$error":"#N/A"}},null,null,null,null,null,{"$error":"#DIV/0!"}]
[{"$f":"VLOOKUP(C27,Kode!A2:C219,2,FALSE)","v":{"$error":"#N/A"}},{"$f":"VLOOKUP(C27,Kode!A2:C219,3,FALSE)","v":{"$error":"#N/A"}},null,{"$f":"VLOOKUP(C27,Kode!A2:D219,4,FALSE)","v":{"$error":"#N/A"}},null,null,null,null,null,null,null,null,null,null,null,null,null,{"$f":"VLOOKUP(C27,Kode!A2:E219,5,FALSE)","v":{"$error":"#N/A"}},null,null,null,null,null,{"$error":"#DIV/0!"}]
[{"$f":"VLOOKUP(C28,Kode!A2:C219,2,FALSE)","v":{"$error":"#N/A"}},{"$f":"VLOOKUP(C28,Kode!A2:C219,3,FALSE)","v":{"$error":"#N/A"}},null,{"$f":"VLOOKUP(C28,Kode!A2:D219,4,FALSE)","v":{"$error":"#N/A"}},null,null,null,null,null,null,null,null,null,null,null,null,null,{"$f":"VLOOKUP(C28,Kode!A2:E219,5,FALSE)","v":{"$error":"#N/A"}},null,null,null,null,null,{"$error":"#DIV/0!"}]
[{"$f":"VLOOKUP(C29,Kode!A2:C219,2,FALSE)","v":{"$error":"#N/A"}},{"$f":"VLOOKUP(C29,Kode!A2:C219,3,FALSE)","v":{"$error":"#N/A"}},null,{"$f":"VLOOKUP(C29,Kode!A2:D219,4,FALSE)","v":{"$error":"#N/A"}},null,null,null,null,null,null,null,null,null,null,null,null,null,{"$f":"VLOOKUP(C29,Kode!A2:E219,5,FALSE)","v":{"$error":"#N/A"}},null,null,null,null,null,{"$error":"#DIV/0!"}]
[{"$f":"VLOOKUP(C30,Kode!A2:C219,2,FALSE)","v":{"$error":"#N/A"}},{"$f":"VLOOKUP(C30,Kode!A2:C219,3,FALSE)","v":{"$error":"#N/A"}},null,{"$f":"VLOOKUP(C30,Kode!A2:D219,4,FALSE)","v":{"$error":"#N/A"}},null,null,null,null,null,null,null,null,null,null,null,null,null,{"$f":"VLOOKUP(C30,Kode!A2:E219,5,FALSE)","v":{"$error":"#N/A"}},null,null,null,null,null,{"$error":"#DIV/0!"}]
{"$rows_left_out":176}
{"sheet":"Kode","index":1,"n_rows":435,"n_cols":11,"rows_kept":435,"cut":false,"hidden":true,"merged":[]}
["Št. Priglasitve","Naziv dajalca pomoči","MŠ dajalca pomoči","Naziv sheme pomoči/ime prejemnika individualne ad hoc pomoči","Pravna podlaga sheme pomoči","Šifra občine","Šifra instrumenta","Šifra namena","Opis ukrepa","Investicija","Člen uredbe"]
["K-M001-2399253-2017","Ministrstvo za kmetijstvo, gozdarstvo in prehrano",2399253000,"Finančna pomoč ob nepredvidljivih dogodkih v kmetijstvu za leto 2017","Uredba o pomoči ob nepredvidljivih dogodkih v kmetijstvu",null,1,"5.0.04.1","a","da",14]
["K-M001-2399253-2020","Ministrstvo za kmetijstvo, gozdarstvo in prehrano",2399253000,"Finančna pomoč ob nepredvidljivih dogodkih v kmetijstvu za leto 2020 in 2021","Uredba o pomoči ob nepredvidljivih dogodkih v kmetijstvu",null,5,"5.0.04.2","b","ne",15]
["K-M001-5163846-2021","Javni zavod Triglavski narodni park",5163846000,"Pomoč za ohranjanje in razvoj kmetijstva in podeželja na območju Triglavskega narodnega parka","Pravilnik o pomoči za ohranjanje in razvoj kmetijstva in podeželja na območju Triglavskega narodnega parka",null,10,"5.0.04.4","c",null,16]
["K-M001-5628849-2016","Javni sklad malega gospodarstva Goriške ",5628849000,"Finančne spodbude Javnega sklada malega gospodarstva Goriške v kmetijskem sektorju za obdobje 2016-2020 - de minimis","Splošni pogoji poslovanja Javnega sklada malega gospodarstva Goriške za kmetijstvo v programskem obdobju 2015–2020",null,20,"5.0.04.5","d",null,17]
["K-M001-5729963-2018","Sklad kmetijskih zemljišč in gozdov Republike Slovenije",5729963000,"Odpis zakupnine zaradi pozebe v letu 2017","Zakon o ukrepih za odpravo posledic pozebe v kmetijski proizvodnji med 21. in 22. aprilom 2017 (ZUOPPKP) ",null,25,"5.0.07.0","e",null,21]
["K-M001-5729963-2019","Sklad kmetijskih zemljišč in gozdov Republike Slovenije",5729963000,"Odpis zakupnine za leto 2017 zaradi suše v letu 2017","Pravilnik o zakupu kmetij in kmetijskih zemljišč (z vključenimi spremembami in dopolnitvami)",null,28,"5.0.10.0","f",null,24]
["K-M002-2399253-2017","Ministrstvo za kmetijstvo, gozdarstvo in prehrano",2399253000,"Finančna podpora za izvajanje ukrepa odpravljanja zaraščanja na kmetijskih zemljiščih","Uredba o izvajanju ukrepa odpravljanje zaraščanja na kmetijskih zemljiščih",null,40,"5.0.11.2","g",null,28]
["K-M002-2399253-2018","Ministrstvo za kmetijstvo, gozdarstvo in prehrano",2399253000,"Finančna pomoč ob nepredvidljivih dogodkih v kmetijstvu za leto 2018","Uredba o pomoči ob nepredvidljivih dogodkih v kmetijstvu",null,43,"5.0.11.3","h",null,29]
["K-M002-2399253-2019","Ministrstvo za kmetijstvo, gozdarstvo in prehrano",2399253000,"Finančna pomoč ob nepredvidljivih dogodkih v kmetijstvu za leto 2019","Uredba o pomoči ob nepredvidljivih dogodkih v kmetijstvu",null,48,"5.0.11.4",null,null,38]
["K-M002-2399253-2021","Ministrstvo za kmetijstvo, gozdarstvo in prehrano",2399253000,"Oprostitev plačila nadomestila za vzdrževanje namakalnih sistemov namakalnega razvoda Vogršček lastnikom in zakupnikom kmetijskih zemljišč na območju namakalnega razvoda Vogršček v letu 2021","Zakon o ukrepih za odpravo posledic pozebe v kmetijski proizvodnji med 5. in 9. aprilom 2021",null,50,"5.0.11.5",null,null,43]
["K-M002-5880297-2020","Občina Radenci",5880297000,"Pomoč čebelarstvu v Občini Radenci","Pravilnik o ohranjanju in spodbujanju razvoja kmetijstva in podeželja v Občini Radenci za programsko obdobje 2015 – 2020",null,70,"5.0.12.0"]
["K-M002-5883075-2016","Občina Gornji Petrovci ",5883075000,"De minimis pomoč za ohranjanje oz. povečevanje rodovitnosti tal v Občini Gornji Petrovci za programsko obdobje 2016-2020","Pravilnik o ohranjanju in spodbujanju razvoja kmetijstva in podeželja v Občini Gornji Petrovci za programsko obdobje 2016–2020",null,75,"5.0.13.0"]
["K-M003-1332171-2019","Občina Veržej",1332171000,"De minimis pomoč za ohranjanje oziroma povečevanje rodovitnosti tal v Občini Veržej za programsko obdobje 2019–2020","Pravilnik o ohranjanju in spodbujanju razvoja kmetijstva in podeželja v Občini Veržej za programsko obdobje 2019–2020",null,null,"5.0.14.1"]
["K-M003-2399253-2018","Ministrstvo za kmetijstvo, gozdarstvo in prehrano",2399253000,"Enkratna pomoč de minimis za nadomestilo zaradi izjemnih okoliščin v zvezi z odločitvijo arbitražnega sodišča o meji med Slovenijo in Hrvaško","11. člen Zakona o ureditvi določenih vprašanj zaradi končne razsodbe arbitražnega sodišča na podlagi Arbitražnega sporazuma med Vlado Republike Slovenije in Vlado Republike Hrvaške",null,null,"5.0.14.2"]
["K-M003-5163846-2020","Javni zavod Triglavski narodni park",5163846000,"Pomoč za ohranjanje in razvoj kmetijstva in podeželja na območju Triglavskega narodnega parka","Pravilnik o pomoči za ohranjanje in razvoj kmetijstva in podeželja na območju Triglavskega narodnega parka",null,null,"5.0.14.3"]
["K-M003-5729963-2021","Sklad kmetijskih zemljišč in gozdov Republike Slovenije",5729963000,"Odpis zakupnin za leto 2021 zaradi pozebe v letu 2021","Pravilnik o zakupu kmetij in kmetijskih zemljišč",null,null,"5.0.14.4"]
["K-M003-5823889-2017","Zavod za regionalni razvoj madžarske narodnosti Lendava",5823889000,"Ohranjanje in spodbujanje razvoja kmetijstva na območjih občin, v katerih živi avtohtona madžarska narodna skupnost za programsko obdobje 2017 - 2020","Pravilnik o ohranjanju in spodbujanju razvoja kmetijstva na območjih občin, v katerih živi avtohtona madžarska narodna skupnost za programsko obdobje 2017-2020",null,null,"5.0.15.0"]
["K-M003-5883377-2015","Občina Zavrč",5883377000,"Pomoč za ohranjanje in razvoj kmetijstva ter podeželja v občini Zavrč","Pravilnik o dodeljevanju pomoči za razvoj podeželja v Občini Zavrč za obdobje 2015 - 2020\n",null,null,"5.1.01.0"]
["K-M003-5883512-2020","Občina Postojna",5883512000,"Pomoč de minimis za subvencioniranje komunalnega prispevka za gradnjo objektov, namenjenih primarni kmetijski proizvodnji, v Občini Postojna","Pravilnik o ohranjanju in spodbujanju razvoja kmetijstva in podeželja v Občini Postojna za programsko obdobje 2015–2020",null,null,"5.1.02.0"]
["K-M003-5883610-2016","Občina Mežica",5883610000,"Podpore za ohranjanje in razvoj kmetijstva in podeželja v občini Mežica za programsko obdobje 2016 - 2020 - de minimis","Pravilnik o ohranjanju in spodbujanju razvoja kmetijstva in podeželja v Občini Mežica za programsko obdobje 2016 – 2020",null,null,"5.1.03.0"]
["K-M003-5883687-2019","Občina Ormož",5883687000,"Olajšave za primarne kmetijske proizvajalce pri plačilu komunalnega prispevka za nestanovanjske stavbe v Občini Ormož za obdobje 2019–2027","Pravilnik o podrobnejših kriterijih in merilih za olajšave plačila komunalnega prispevka za nestanovanjske kmetijske stavbe v Občini Ormož (Uradni vestnik Občine Ormož, št. 18/18)",null,null,"5.1.04.0"]
["K-M004-1358278-2015","Občina Podlehnik",1358278000,"Pomoči za ohranjanje in razvoj kmetijstva ter podeželja v občini Podlehnik","Pravilnik o dodeljevanju pomoči za ohranjanje in razvoj kmetijstva ter podeželja v Občini Podlehnik za obdobje 2014 - 2020",null,null,"5.1.05.0"]
["K-M004-2399253-2021","Ministrstvo za kmetijstvo, gozdarstvo in prehrano",2399253000,"Finančna pomoč za nadomestilo škode v čebelarstvu v letu 2021","Odlok o finančni pomoči za nadomestilo škode v čebelarstvu v letu 2021",null,null,"5.1.06.0"]
["K-M004-5874092-2019","Občina Ljutomer",5874092000,"De minimis pomoč za ohranjanje oziroma povečanje rodovitnosti tal v Občini Ljutomer","Pravilnik o ohranjanju in spodbujanju razvoja kmetijstva in podeželja v Občini Ljutomer",null,null,"5.2.01.0"]
["K-M004-5874637-2017","Občina Vodice",5874637000,"Olajšave plačila komunalnega prispevka za nestanovanjske kmetijske stavbe v Občini Vodice","Pravilnik o ohranjanju in spodbujanju razvoja kmetijstva in podeželja v Občini Vodice za programsko obdobje 2015–2020",null,null,"5.2.02.0"]
["K-M004-5883164-2016","Občina Moravske Toplice",5883164000,"De minimis pomoč za  ohranjanje  oz. povečevanje rodovitnosti tal v Občini Moravske toplice  za programsko obdobje 2016-2020","Pravilnik o ohranjanju in spodbujanju razvoja kmetijstva in podeželja v Občini Moravske Toplice za programsko obdobje 2016–2020",null,null,"5.7.00.0"]
["K-M004-5883687-2020","Občina Ormož",5883687000,"Subvencioniranje obrestne mere in stroškov odobritve kratkoročnega kredita za nakup repromateriala in financiranje tekočih stroškov primarne kmetijske proizvodnje","Pravilnik o ohranjanju in spodbujanju razvoja kmetijstva in podeželja v občini Ormož  za programsko obdobje 2015-2020",null,null,"5.8.01.0"]
["K-M004-5883903-2018","Mestna občina Slovenj Gradec",5883903000,"Ukrep 10: Podpora za tekoče poslovanje v kmetijski proizvodnji","Pravilnik o ohranjanju in spodbujanju razvoja kmetijstva in podeželja v Mestni občini Slovenj Gradec za programsko obdobje 2015–2020",null,null,"5.8.02.0"]
["K-M005-1332147-2018","Občina Križevci",1332147000,"De minimis pomoč za ohranjanje oziroma povečevanje rodovitnosti tal v Občini Križevci za programsko obdobje 2018–2020","Pravilnik o ohranjanju in spodbujanju razvoja kmetijstva in podeželja v Občini Križevci za programsko obdobje 2018–2020",null,null,"5.8.03.0"]
{"$rows_left_out":405}