{"text_format":"1","workbook":"xlsx","n_sheets":2,"sheets":["Obrazec preveritev in poročanje","Kode"],"not_rendered":{"charts":0,"images":0,"macros":1,"external_links":0,"defined_names":2,"comments":1,"pivot_tables":0},"unopened":[],"bounds":{"document_bytes":16777216,"sheet_cells":100000,"rows_first":2000,"rows_last":500,"rows_between":2000,"halvings":0,"cell_chars":16384,"cell_head_chars":4096},"cells_cut":0,"cells_raw":0,"read":"whole","date_system":"1900"}

{"sheet":"Obrazec preveritev in poročanje","index":0,"n_rows":1000,"n_cols":20,"rows_kept":1000,"cut":false,"hidden":false,"merged":[]}
["Naziv dajalca pomoči","Matična številka dajalca pomoči","Številka priglasitve","Naziv sheme pomoči de minimis ali individualne ad hoc pomoči de minimis","Matična številka upravičenca","Ime in priimek upravičenca ali naziv pravne osebe, ki je upravičenec","Davčna št.  upravičenca","KMG-MID-številka upravičenca","Naslov upravičenca (ime ulice in hišna številka, poštna številka in naziv pošte)","Šifra občine upravičenca","Datum odobritve pomoči","Datum nakazila pomoči upravičencu","Šifra instrumenta pomoči","Pravna podlaga za odobritev pomoči","Naziv, številka in datum pravnega akta, s katerim je upravičencu pomoč dodeljena","Znesek upravičenih stroškov (EUR)","Bruto znesek pomoči \n(EUR)","Neto znesek \npomoči (EUR)","Število udeležencev","Stopnja intenzivnosti pomoči (%)"]
[{"$f":"VLOOKUP(C2,Kode!A2:C1008,2,FALSE)","v":{"$error":"#N/A"}},{"$f":"VLOOKUP(C2,Kode!A2:C1008,3,FALSE)","v":{"$error":"#N/A"}},null,{"$f":"VLOOKUP(C2,Kode!A2:D1008,4,FALSE)","v":{"$error":"#N/A"}},null,null,null,null,null,null,null,null,null,{"$f":"VLOOKUP(C2,Kode!A2:E1008,5,FALSE)","v":{"$error":"#N/A"}},null,null,null,null,null,{"$f":"R2/P2*100","v":{"$error":"#DIV/0!"}}]
[{"$f":"VLOOKUP(C3,Kode!A2:C1008,2,FALSE)","v":{"$error":"#N/A"}},{"$f":"VLOOKUP(C3,Kode!A2:C1008,3,FALSE)","v":{"$error":"#N/A"}},null,{"$f":"VLOOKUP(C3,Kode!A2:D1008,4,FALSE)","v":{"$error":"#N/A"}},null,null,null,null,null,null,null,null,null,{"$f":"VLOOKUP(C3,Kode!A2:E1008,5,FALSE)","v":{"$error":"#N/A"}},null,null,null,null,null,{"$error":"#DIV/0!"}]
[{"$f":"VLOOKUP(C4,Kode!A2:C1008,2,FALSE)","v":{"$error":"#N/A"}},{"$f":"VLOOKUP(C4,Kode!A2:C1008,3,FALSE)","v":{"$error":"#N/A"}},null,{"$f":"VLOOKUP(C4,Kode!A2:D1008,4,FALSE)","v":{"$error":"#N/A"}},null,null,null,null,null,null,null,null,null,{"$f":"VLOOKUP(C4,Kode!A2:E1008,5,FALSE)","v":{"$error":"#N/A"}},null,null,null,null,null,{"$error":"#DIV/0!"}]
[{"$f":"VLOOKUP(C5,Kode!A2:C1008,2,FALSE)","v":{"$error":"#N/A"}},{"$f":"VLOOKUP(C5,Kode!A2:C1008,3,FALSE)","v":{"$error":"#N/A"}},null,{"$f":"VLOOKUP(C5,Kode!A2:D1008,4,FALSE)","v":{"$error":"#N/A"}},null,null,null,null,null,null,null,null,null,{"$f":"VLOOKUP(C5,Kode!A2:E1008,5,FALSE)","v":{"$error":"#N/A"}},null,null,null,null,null,{"$error":"#DIV/0!"}]
[{"$f":"VLOOKUP(C6,Kode!A2:C1008,2,FALSE)","v":{"$error":"#N/A"}},{"$f":"VLOOKUP(C6,Kode!A2:C1008,3,FALSE)","v":{"$error":"#N/A"}},null,{"$f":"VLOOKUP(C6,Kode!A2:D1008,4,FALSE)","v":{"$error":"#N/A"}},null,null,null,null,null,null,null,null,null,{"$f":"VLOOKUP(C6,Kode!A2:E1008,5,FALSE)","v":{"$error":"#N/A"}},null,null,null,null,null,{"$error":"#DIV/0!"}]
[{"$f":"VLOOKUP(C7,Kode!A2:C1008,2,FALSE)","v":{"$error":"#N/A"}},{"$f":"VLOOKUP(C7,Kode!A2:C1008,3,FALSE)","v":{"$error":"#N/A"}},null,{"$f":"VLOOKUP(C7,Kode!A2:D1008,4,FALSE)","v":{"$error":"#N/A"}},null,null,null,null,null,null,null,null,null,{"$f":"VLOOKUP(C7,Kode!A2:E1008,5,FALSE)","v":{"$error":"#N/A"}},null,null,null,null,null,{"$error":"#DIV/0!"}]
[{"$f":"VLOOKUP(C8,Kode!A2:C1008,2,FALSE)","v":{"$error":"#N/A"}},{"$f":"VLOOKUP(C8,Kode!A2:C1008,3,FALSE)","v":{"$error":"#N/A"}},null,{"$f":"VLOOKUP(C8,Kode!A2:D1008,4,FALSE)","v":{"$error":"#N/A"}},null,null,null,null,null,null,null,null,null,{"$f":"VLOOKUP(C8,Kode!A2:E1008,5,FALSE)","v":{"$error":"#N/A"}},null,null,null,null,null,{"$error":"#DIV/0!"}]
[{"$f":"VLOOKUP(C9,Kode!A2:C1008,2,FALSE)","v":{"$error":"#N/A"}},{"$f":"VLOOKUP(C9,Kode!A2:C1008,3,FALSE)","v":{"$error":"#N/A"}},null,{"$f":"VLOOKUP(C9,Kode!A2:D1008,4,FALSE)","v":{"$error":"#N/A"}},null,null,null,null,null,null,null,null,null,{"$f":"VLOOKUP(C9,Kode!A2:E1008,5,FALSE)","v":{"$error":"#N/A"}},null,null,null,null,null,{"$error":"#DIV/0!"}]
[{"$f":"VLOOKUP(C10,Kode!A2:C1008,2,FALSE)","v":{"$error":"#N/A"}},{"$f":"VLOOKUP(C10,Kode!A2:C1008,3,FALSE)","v":{"$error":"#N/A"}},null,{"$f":"VLOOKUP(C10,Kode!A2:D1008,4,FALSE)","v":{"$error":"#N/A"}},null,null,null,null,null,null,null,null,null,{"$f":"VLOOKUP(C10,Kode!A2:E1008,5,FALSE)","v":{"$error":"#N/A"}},null,null,null,null,null,{"$error":"#DIV/0!"}]
[{"$f":"VLOOKUP(C11,Kode!A2:C1008,2,FALSE)","v":{"$error":"#N/A"}},{"$f":"VLOOKUP(C11,Kode!A2:C1008,3,FALSE)","v":{"$error":"#N/A"}},null,{"$f":"VLOOKUP(C11,Kode!A2:D1008,4,FALSE)","v":{"$error":"#N/A"}},null,null,null,null,null,null,null,null,null,{"$f":"VLOOKUP(C11,Kode!A2:E1008,5,FALSE)","v":{"$error":"#N/A"}},null,null,null,null,null,{"$error":"#DIV/0!"}]
[{"$f":"VLOOKUP(C12,Kode!A2:C1008,2,FALSE)","v":{"$error":"#N/A"}},{"$f":"VLOOKUP(C12,Kode!A2:C1008,3,FALSE)","v":{"$error":"#N/A"}},null,{"$f":"VLOOKUP(C12,Kode!A2:D1008,4,FALSE)","v":{"$error":"#N/A"}},null,null,null,null,null,null,null,null,null,{"$f":"VLOOKUP(C12,Kode!A2:E1008,5,FALSE)","v":{"$error":"#N/A"}},null,null,null,null,null,{"$error":"#DIV/0!"}]
[{"$f":"VLOOKUP(C13,Kode!A2:C1008,2,FALSE)","v":{"$error":"#N/A"}},{"$f":"VLOOKUP(C13,Kode!A2:C1008,3,FALSE)","v":{"$error":"#N/A"}},null,{"$f":"VLOOKUP(C13,Kode!A2:D1008,4,FALSE)","v":{"$error":"#N/A"}},null,null,null,null,null,null,null,null,null,{"$f":"VLOOKUP(C13,Kode!A2:E1008,5,FALSE)","v":{"$error":"#N/A"}},null,null,null,null,null,{"$error":"#DIV/0!"}]
[{"$f":"VLOOKUP(C14,Kode!A2:C1008,2,FALSE)","v":{"$error":"#N/A"}},{"$f":"VLOOKUP(C14,Kode!A2:C1008,3,FALSE)","v":{"$error":"#N/A"}},null,{"$f":"VLOOKUP(C14,Kode!A2:D1008,4,FALSE)","v":{"$error":"#N/A"}},null,null,null,null,null,null,null,null,null,{"$f":"VLOOKUP(C14,Kode!A2:E1008,5,FALSE)","v":{"$error":"#N/A"}},null,null,null,null,null,{"$error":"#DIV/0!"}]
[{"$f":"VLOOKUP(C15,Kode!A2:C1008,2,FALSE)","v":{"$error":"#N/A"}},{"$f":"VLOOKUP(C15,Kode!A2:C1008,3,FALSE)","v":{"$error":"#N/A"}},null,{"$f":"VLOOKUP(C15,Kode!A2:D1008,4,FALSE)","v":{"$error":"#N/A"}},null,null,null,null,null,null,null,null,null,{"$f":"VLOOKUP(C15,Kode!A2:E1008,5,FALSE)","v":{"$error":"#N/A"}},null,null,null,null,null,{"$error":"#DIV/0!"}]
[{"$f":"VLOOKUP(C16,Kode!A2:C1008,2,FALSE)","v":{"$error":"#N/A"}},{"$f":"VLOOKUP(C16,Kode!A2:C1008,3,FALSE)","v":{"$error":"#N/A"}},null,{"$f":"VLOOKUP(C16,Kode!A2:D1008,4,FALSE)","v":{"$error":"#N/A"}},null,null,null,null,null,null,null,null,null,{"$f":"VLOOKUP(C16,Kode!A2:E1008,5,FALSE)","v":{"$error":"#N/A"}},null,null,null,null,null,{"$error":"#DIV/0!"}]
[{"$f":"VLOOKUP(C17,Kode!A2:C1008,2,FALSE)","v":{"$error":"#N/A"}},{"$f":"VLOOKUP(C17,Kode!A2:C1008,3,FALSE)","v":{"$error":"#N/A"}},null,{"$f":"VLOOKUP(C17,Kode!A2:D1008,4,FALSE)","v":{"$error":"#N/A"}},null,null,null,null,null,null,null,null,null,{"$f":"VLOOKUP(C17,Kode!A2:E1008,5,FALSE)","v":{"$error":"#N/A"}},null,null,null,null,null,{"$error":"#DIV/0!"}]
[{"$f":"VLOOKUP(C18,Kode!A2:C1008,2,FALSE)","v":{"$error":"#N/A"}},{"$f":"VLOOKUP(C18,Kode!A2:C1008,3,FALSE)","v":{"$error":"#N/A"}},null,{"$f":"VLOOKUP(C18,Kode!A2:D1008,4,FALSE)","v":{"$error":"#N/A"}},null,null,null,null,null,null,null,null,null,{"$f":"VLOOKUP(C18,Kode!A2:E1008,5,FALSE)","v":{"$error":"#N/A"}},null,null,null,null,null,{"$error":"#DIV/0!"}]
[{"$f":"VLOOKUP(C19,Kode!A2:C1008,2,FALSE)","v":{"$error":"#N/A"}},{"$f":"VLOOKUP(C19,Kode!A2:C1008,3,FALSE)","v":{"$error":"#N/A"}},null,{"$f":"VLOOKUP(C19,Kode!A2:D1008,4,FALSE)","v":{"$error":"#N/A"}},null,null,null,null,null,null,null,null,null,{"$f":"VLOOKUP(C19,Kode!A2:E1008,5,FALSE)","v":{"$error":"#N/A"}},null,null,null,null,null,{"$error":"#DIV/0!"}]
[{"$f":"VLOOKUP(C20,Kode!A2:C1008,2,FALSE)","v":{"$error":"#N/A"}},{"$f":"VLOOKUP(C20,Kode!A2:C1008,3,FALSE)","v":{"$error":"#N/A"}},null,{"$f":"VLOOKUP(C20,Kode!A2:D1008,4,FALSE)","v":{"$error":"#N/A"}},null,null,null,null,null,null,null,null,null,{"$f":"VLOOKUP(C20,Kode!A2:E1008,5,FALSE)","v":{"$error":"#N/A"}},null,null,null,null,null,{"$error":"#DIV/0!"}]
[{"$f":"VLOOKUP(C21,Kode!A2:C1008,2,FALSE)","v":{"$error":"#N/A"}},{"$f":"VLOOKUP(C21,Kode!A2:C1008,3,FALSE)","v":{"$error":"#N/A"}},null,{"$f":"VLOOKUP(C21,Kode!A2:D1008,4,FALSE)","v":{"$error":"#N/A"}},null,null,null,null,null,null,null,null,null,{"$f":"VLOOKUP(C21,Kode!A2:E1008,5,FALSE)","v":{"$error":"#N/A"}},null,null,null,null,null,{"$error":"#DIV/0!"}]
[{"$f":"VLOOKUP(C22,Kode!A2:C1008,2,FALSE)","v":{"$error":"#N/A"}},{"$f":"VLOOKUP(C22,Kode!A2:C1008,3,FALSE)","v":{"$error":"#N/A"}},null,{"$f":"VLOOKUP(C22,Kode!A2:D1008,4,FALSE)","v":{"$error":"#N/A"}},null,null,null,null,null,null,null,null,null,{"$f":"VLOOKUP(C22,Kode!A2:E1008,5,FALSE)","v":{"$error":"#N/A"}},null,null,null,null,null,{"$error":"#DIV/0!"}]
[{"$f":"VLOOKUP(C23,Kode!A2:C1008,2,FALSE)","v":{"$error":"#N/A"}},{"$f":"VLOOKUP(C23,Kode!A2:C1008,3,FALSE)","v":{"$error":"#N/A"}},null,{"$f":"VLOOKUP(C23,Kode!A2:D1008,4,FALSE)","v":{"$error":"#N/A"}},null,null,null,null,null,null,null,null,null,{"$f":"VLOOKUP(C23,Kode!A2:E1008,5,FALSE)","v":{"$error":"#N/A"}},null,null,null,null,null,{"$error":"#DIV/0!"}]
[{"$f":"VLOOKUP(C24,Kode!A2:C1008,2,FALSE)","v":{"$error":"#N/A"}},{"$f":"VLOOKUP(C24,Kode!A2:C1008,3,FALSE)","v":{"$error":"#N/A"}},null,{"$f":"VLOOKUP(C24,Kode!A2:D1008,4,FALSE)","v":{"$error":"#N/A"}},null,null,null,null,null,null,null,null,null,{"$f":"VLOOKUP(C24,Kode!A2:E1008,5,FALSE)","v":{"$error":"#N/A"}},null,null,null,null,null,{"$error":"#DIV/0!"}]
[{"$f":"VLOOKUP(C25,Kode!A2:C1008,2,FALSE)","v":{"$error":"#N/A"}},{"$f":"VLOOKUP(C25,Kode!A2:C1008,3,FALSE)","v":{"$error":"#N/A"}},null,{"$f":"VLOOKUP(C25,Kode!A2:D1008,4,FALSE)","v":{"$error":"#N/A"}},null,null,null,null,null,null,null,null,null,{"$f":"VLOOKUP(C25,Kode!A2:E1008,5,FALSE)","v":{"$error":"#N/A"}},null,null,null,null,null,{"$error":"#DIV/0!"}]
[{"$f":"VLOOKUP(C26,Kode!A2:C1008,2,FALSE)","v":{"$error":"#N/A"}},{"$f":"VLOOKUP(C26,Kode!A2:C1008,3,FALSE)","v":{"$error":"#N/A"}},null,{"$f":"VLOOKUP(C26,Kode!A2:D1008,4,FALSE)","v":{"$error":"#N/A"}},null,null,null,null,null,null,null,null,null,{"$f":"VLOOKUP(C26,Kode!A2:E1008,5,FALSE)","v":{"$error":"#N/A"}},null,null,null,null,null,{"$error":"#DIV/0!"}]
[{"$f":"VLOOKUP(C27,Kode!A2:C1008,2,FALSE)","v":{"$error":"#N/A"}},{"$f":"VLOOKUP(C27,Kode!A2:C1008,3,FALSE)","v":{"$error":"#N/A"}},null,{"$f":"VLOOKUP(C27,Kode!A2:D1008,4,FALSE)","v":{"$error":"#N/A"}},null,null,null,null,null,null,null,null,null,{"$f":"VLOOKUP(C27,Kode!A2:E1008,5,FALSE)","v":{"$error":"#N/A"}},null,null,null,null,null,{"$error":"#DIV/0!"}]
[{"$f":"VLOOKUP(C28,Kode!A2:C1008,2,FALSE)","v":{"$error":"#N/A"}},{"$f":"VLOOKUP(C28,Kode!A2:C1008,3,FALSE)","v":{"$error":"#N/A"}},null,{"$f":"VLOOKUP(C28,Kode!A2:D1008,4,FALSE)","v":{"$error":"#N/A"}},null,null,null,null,null,null,null,null,null,{"$f":"VLOOKUP(C28,Kode!A2:E1008,5,FALSE)","v":{"$error":"#N/A"}},null,null,null,null,null,{"$error":"#DIV/0!"}]
[{"$f":"VLOOKUP(C29,Kode!A2:C1008,2,FALSE)","v":{"$error":"#N/A"}},{"$f":"VLOOKUP(C29,Kode!A2:C1008,3,FALSE)","v":{"$error":"#N/A"}},null,{"$f":"VLOOKUP(C29,Kode!A2:D1008,4,FALSE)","v":{"$error":"#N/A"}},null,null,null,null,null,null,null,null,null,{"$f":"VLOOKUP(C29,Kode!A2:E1008,5,FALSE)","v":{"$error":"#N/A"}},null,null,null,null,null,{"$error":"#DIV/0!"}]
[{"$f":"VLOOKUP(C30,Kode!A2:C1008,2,FALSE)","v":{"$error":"#N/A"}},{"$f":"VLOOKUP(C30,Kode!A2:C1008,3,FALSE)","v":{"$error":"#N/A"}},null,{"$f":"VLOOKUP(C30,Kode!A2:D1008,4,FALSE)","v":{"$error":"#N/A"}},null,null,null,null,null,null,null,null,null,{"$f":"VLOOKUP(C30,Kode!A2:E1008,5,FALSE)","v":{"$error":"#N/A"}},null,null,null,null,null,{"$error":"#DIV/0!"}]
[{"$f":"VLOOKUP(C31,Kode!A2:C1008,2,FALSE)","v":{"$error":"#N/A"}},{"$f":"VLOOKUP(C31,Kode!A2:C1008,3,FALSE)","v":{"$error":"#N/A"}},null,{"$f":"VLOOKUP(C31,Kode!A2:D1008,4,FALSE)","v":{"$error":"#N/A"}},null,null,null,null,null,null,null,null,null,{"$f":"VLOOKUP(C31,Kode!A2:E1008,5,FALSE)","v":{"$error":"#N/A"}},null,null,null,null,null,{"$error":"#DIV/0!"}]
[{"$f":"VLOOKUP(C32,Kode!A2:C1008,2,FALSE)","v":{"$error":"#N/A"}},{"$f":"VLOOKUP(C32,Kode!A2:C1008,3,FALSE)","v":{"$error":"#N/A"}},null,{"$f":"VLOOKUP(C32,Kode!A2:D1008,4,FALSE)","v":{"$error":"#N/A"}},null,null,null,null,null,null,null,null,null,{"$f":"VLOOKUP(C32,Kode!A2:E1008,5,FALSE)","v":{"$error":"#N/A"}},null,null,null,null,null,{"$error":"#DIV/0!"}]
[{"$f":"VLOOKUP(C33,Kode!A2:C1008,2,FALSE)","v":{"$error":"#N/A"}},{"$f":"VLOOKUP(C33,Kode!A2:C1008,3,FALSE)","v":{"$error":"#N/A"}},null,{"$f":"VLOOKUP(C33,Kode!A2:D1008,4,FALSE)","v":{"$error":"#N/A"}},null,null,null,null,null,null,null,null,null,{"$f":"VLOOKUP(C33,Kode!A2:E1008,5,FALSE)","v":{"$error":"#N/A"}},null,null,null,null,null,{"$error":"#DIV/0!"}]
[{"$f":"VLOOKUP(C34,Kode!A2:C1008,2,FALSE)","v":{"$error":"#N/A"}},{"$f":"VLOOKUP(C34,Kode!A2:C1008,3,FALSE)","v":{"$error":"#N/A"}},null,{"$f":"VLOOKUP(C34,Kode!A2:D1008,4,FALSE)","v":{"$error":"#N/A"}},null,null,null,null,null,null,null,null,null,{"$f":"VLOOKUP(C34,Kode!A2:E1008,5,FALSE)","v":{"$error":"#N/A"}},null,null,null,null,null,{"$error":"#DIV/0!"}]
[{"$f":"VLOOKUP(C35,Kode!A2:C1008,2,FALSE)","v":{"$error":"#N/A"}},{"$f":"VLOOKUP(C35,Kode!A2:C1008,3,FALSE)","v":{"$error":"#N/A"}},null,{"$f":"VLOOKUP(C35,Kode!A2:D1008,4,FALSE)","v":{"$error":"#N/A"}},null,null,null,null,null,null,null,null,null,{"$f":"VLOOKUP(C35,Kode!A2:E1008,5,FALSE)","v":{"$error":"#N/A"}},null,null,null,null,null,{"$error":"#DIV/0!"}]
[{"$f":"VLOOKUP(C36,Kode!A2:C1008,2,FALSE)","v":{"$error":"#N/A"}},{"$f":"VLOOKUP(C36,Kode!A2:C1008,3,FALSE)","v":{"$error":"#N/A"}},null,{"$f":"VLOOKUP(C36,Kode!A2:D1008,4,FALSE)","v":{"$error":"#N/A"}},null,null,null,null,null,null,null,null,null,{"$f":"VLOOKUP(C36,Kode!A2:E1008,5,FALSE)","v":{"$error":"#N/A"}},null,null,null,null,null,{"$error":"#DIV/0!"}]
[{"$f":"VLOOKUP(C37,Kode!A2:C1008,2,FALSE)","v":{"$error":"#N/A"}},{"$f":"VLOOKUP(C37,Kode!A2:C1008,3,FALSE)","v":{"$error":"#N/A"}},null,{"$f":"VLOOKUP(C37,Kode!A2:D1008,4,FALSE)","v":{"$error":"#N/A"}},null,null,null,null,null,null,null,null,null,{"$f":"VLOOKUP(C37,Kode!A2:E1008,5,FALSE)","v":{"$error":"#N/A"}},null,null,null,null,null,{"$error":"#DIV/0!"}]
[{"$f":"VLOOKUP(C38,Kode!A2:C1008,2,FALSE)","v":{"$error":"#N/A"}},{"$f":"VLOOKUP(C38,Kode!A2:C1008,3,FALSE)","v":{"$error":"#N/A"}},null,{"$f":"VLOOKUP(C38,Kode!A2:D1008,4,FALSE)","v":{"$error":"#N/A"}},null,null,null,null,null,null,null,null,null,{"$f":"VLOOKUP(C38,Kode!A2:E1008,5,FALSE)","v":{"$error":"#N/A"}},null,null,null,null,null,{"$error":"#DIV/0!"}]
[{"$f":"VLOOKUP(C39,Kode!A2:C1008,2,FALSE)","v":{"$error":"#N/A"}},{"$f":"VLOOKUP(C39,Kode!A2:C1008,3,FALSE)","v":{"$error":"#N/A"}},null,{"$f":"VLOOKUP(C39,Kode!A2:D1008,4,FALSE)","v":{"$error":"#N/A"}},null,null,null,null,null,null,null,null,null,{"$f":"VLOOKUP(C39,Kode!A2:E1008,5,FALSE)","v":{"$error":"#N/A"}},null,null,null,null,null,{"$error":"#DIV/0!"}]
[{"$f":"VLOOKUP(C40,Kode!A2:C1008,2,FALSE)","v":{"$error":"#N/A"}},{"$f":"VLOOKUP(C40,Kode!A2:C1008,3,FALSE)","v":{"$error":"#N/A"}},null,{"$f":"VLOOKUP(C40,Kode!A2:D1008,4,FALSE)","v":{"$error":"#N/A"}},null,null,null,null,null,null,null,null,null,{"$f":"VLOOKUP(C40,Kode!A2:E1008,5,FALSE)","v":{"$error":"#N/A"}},null,null,null,null,null,{"$error":"#DIV/0!"}]
{"$rows_left_out":961}
{"sheet":"Kode","index":1,"n_rows":443,"n_cols":7,"rows_kept":443,"cut":false,"hidden":true,"merged":[]}
["Št. Priglasitve","Naziv dajalca pomoči","MŠ dajalca pomoči","Naziv sheme pomoči/ime prejemnika individualne ad hoc pomoči","Pravna podlaga sheme pomoči","Šifra občine","Šifra instrumenta"]
["KDM-001-5940117-2024","Slovenski regionalno razvojni sklad",5940117000,"Pomoč de minimis primarni kmetijski proizvodnji","Pravilnik o dodeljevanju spodbud v kmetijskem in gozdarskem sektorju, sektorju ribištva in akvakulture ter na podeželju",null,1]
["KDM-002-5883113-2024","Občina Šalovci",5883113000,"De minimis pomoč za ohranjanje oz. povečanje rodovitnosti tal v Občini Šalovci","Pravilnik o ohranjanju in spodbujanju razvoja kmetijstva in podeželja v Občini Šalovci",null,5]
["KDM-003-5883075-2023","Občina Gornji Petrovci ",5883075000,"De minimis pomoč za ohranjanje oz. povečevanje rodovitnosti tal v Občini Gornji Petrovci","Pravilnik o ohranjanju in spodbujanju razvoja kmetijstva in podeželja v Občini Gornji Petrovci",null,10]
["KDM-003-5883903-2024","Mestna občina Slovenj Gradec",5883903000,"Ukrep 4: Podpora za tekoče poslovanje v kmetijski proizvodnji","Pravilnik o ohranjanju in spodbujanju razvoja kmetijstva in podeželja v Mestni občini Slovenj Gradec",null,20]
["KDM-004-2399253-2023","Ministrstvo za kmetijstvo, gozdarstvo in prehrano",2399253000,"Finančna pomoč ob nepredvidljivih dogodkih v kmetijstvu za leti 2024 in 2025","Uredba o pomoči ob nepredvidljivih dogodkih v kmetijstvu",null,25]
["KDM-005-5881544-2023","Občina Žalec",5881544000,"UKREP 2: Pomoč za ohranjanje narave","Pravilnik o ohranjanju in spodbujanju razvoja kmetijstva in podeželja v občini Žalec",null,28]
["KDM-005-5882958-2024","Občina Trebnje",5882958000,"Podpora za tekoče poslovanje v primarni kmetijski proizvodnji","Pravilnik o ohranjanju in spodbujanju razvoja kmetijstva in podeželja v Občini Trebnje",null,40]
["KDM-006-5883016-2023","Občina Beltinci",5883016000,"Podpora ohranjanju oziroma povečevanju rodovitnosti tal","Pravilnik o ohranjanju in spodbujanju razvoja kmetijstva, gozdarstva in podeželja v Občini Beltinci",null,43]
["KDM-007-1357441-2024","Občina Hajdina",1357441000,"Pomoč kmetijskim gospodarstvom v primarni kmetijski proizvodnji v Občini Hajdina","Pravilnik o dodeljevanju pomoči za ohranjanje in razvoj kmetijstva ter podeželja v Občini Hajdina",null,48]
["KDM-008-2399253-2023","Ministrstvo za kmetijstvo, gozdarstvo in prehrano",2399253000,"Finančna podpora za izvajanje ukrepa odpravljanje zaraščanja na kmetijskih zemljiščih","Uredba o izvajanju ukrepa odpravljanje zaraščanja na kmetijskih zemljiščih",null,50]
["KDM-008-5883008-2024","Občina Sevnica",5883008000,"Podpora za tekoče poslovanje v primarni kmetijski proizvodnji","Pravilnik o ohranjanju in spodbujanju razvoja kmetijstva in podeželja v Občini Sevnica",null,70]
["KDM-009-5883288-2024","Mestna občina Novo mesto",5883288000,"Podpore za tekoče poslovanje v primarni kmetijski proizvodnji","Pravilnik o ohranjanju in spodbujanju razvoja kmetijstva in podeželja v Mestni občini Novo mesto",null,75]
["KDM-010-2399253-2024","Ministrstvo za kmetijstvo, gozdarstvo in prehrano",2399253000,"Finančna pomoč za 100-odstotno uničenje kmetijskih pridelkov, trajnih nasadov in izgubo plemenske živine zaradi pozebe, neurij s točo in poplav leta 2023","Odlok o finančni pomoči za odpravo posledic škode v kmetijstvu zaradi pozebe, neurij s točo in poplav leta 2023"]
["KDM-011-5874572-2024","Mestna občina Krško",5874572000,"Podpora za tekoče poslovanje v primarni kmetijski proizvodnji v Mestni občini Krško","Pravilnik o ohranjanju in spodbujanju razvoja kmetijstva, gozdarstva in podeželja v Mestni občini Krško"]
["KDM-012-1357603-2024","Občina Polzela",1357603000,"Pomoč za tekoče stroške primarne kmetijske proizvodnje","Pravilnik o ohranjanju in spodbujanju razvoja kmetijstva in podeželja v Občini Polzela"]
["KDM-013-5883512-2024","Občina Postojna",5883512000,"Pomoč za primarno kmetijsko proizvodnjo v Občini Postojna","Pravilnik o ohranjanju in spodbujanju razvoja kmetijstva, gozdarstva in podeželja v Občini Postojna"]
["KDM-014-5884268-2024","Mestna občina Velenje",5884268000,"Podpora za tekoče poslovanje v primarni kmetijski proizvodnji","Pravilnik o ohranjanju in spodbujanju razvoja kemtijstva, gozdarstva in podeželja v Mestni občini Velenje"]
["KDM-015-5881455-2024","Občina Tolmin",5881455000,"Dodeljevanje pomoči de minimis v primarni kmetijski proizvodnji v Občini Tolmin","Pravilnik o dodeljevanju pomoči za ohranjanje in spodbujanje razvoja kmetijstva, gozdarstva in podeželja v Občini Tolmin"]
["KDM-017-5883164-2024","Občina Moravske Toplice",5883164000,"Podpora ohranjanju oziroma povečevanju rodovitnosti tal","Pravilnik o ohranjanju in spodbujanju razvoja kmetijstva in podeželja v Občini Moravske Toplice"]
["KDM-018-1365789-2024","Občina Cankova",1365789000,"Podpora ohranjanju oziroma povečanju rodovitnosti tal na območju Občine Cankova v skladu z uredbo 1408/2013","Pravilnik o ohranjanju in spodbujanju razvoja kmetijstva in podeželja v Občini Cankova"]
["KDM-019-5883954-2024","Občina Mislinja",5883954000,"Dodeljevanje pomoči de minimis v primarni kmetijski proizvodnji v Občini Mislinja","Pravilnik o ohranjanju in spodbujanju razvoja kmetijstva in podeželja v Občini Mislinja "]
["KDM-020-1365673-2024","Občina Grad",1365673000,"Podpora ohranjanju oziroma povečanju rodovitnosti tal na območju Občine Grad v skladu z uredbo 1408/2013","Pravilnik o ohranjanju in spodbujanju razvoja kmetijstva in podeželja v Občini Grad"]
["KDM-021-5874335-2024","Občina Jesenice",5874335000,"Podpora za tekoče poslovanje v primarni kmetijski proizvodnji v Občini Jesenice","Pravilnik o ohranjanju in spodbujanju razvoja kmetijstva, gozdarstva in podeželja v Občini Jesenice"]
["KDM-022-1357557-2024","Občina Braslovče ",1357557000,"Spodbujanje razvoja kmetijstva in podeželja v Občini Braslovče","Pravilnik o ohranjanju in spodbujanju razvoja kmetijstva in podeželja v Občini Braslovče"]
["KDM-023-2241145-2024","Občina Straža",2241145000,"Ukrepi de minimis za podporo ohranjanju in spodbujanju razvoja kmetijstva in podeželja v Občini Straža","Pravilnik o ohranjanju in spodbujanju razvoja kmetijstva in podeželja v Občini Straža"]
["KDM-024-5880254-2024","Občina Črnomelj",5880254000,"UKREP 10: Podpora za tekoče poslovanje v primarni kmetijski proizvodnji","Pravilnik o ohranjanju in spodbujanju razvoja kmetijstva, gozdarstva in podeželja v občini Črnomelj"]
["KDM-025-5883300-2024","Občina Duplek",5883300000,"Ohranjanje in razvoj kmetijstva in podeželja v Občini Duplek","Pravilnik o dodeljevanju pomoči za ohranjanje in razvoj kmetijstva ter podeželja v Občini Duplek "]
["KDM-026-5874785-2024","Občina Velike Lašče",5874785000,"Pomoči de minimis za ohranjanje in spodbujanje razvoja kmetijstva in podeželja v Občini Velike Lašče","Pravilnik o spremembah in dopolnitvah Pravilnika o ohranjanju in spodbujanju razvoja kmetijstva in podeželja v Občini Velike Lašče"]
["KDM-026-5880351-2024","Občina Dravograd",5880351000,"Spodbujanje razvoja kmetijstva v Občini Dravograd","Pravilnik o ohranjanju in spodbujanju razvoja kmetijstva, gozdarstva in podeželja v Občini Dravograd"]
["KDM-027-1357344-2024","Občina Hodoš",1357344000,"Ohranjanje in spodbujanje razvoja kmetijstva in podeželja v Občini Hodoš","Pravilnik o ohranjanju in spodbujanju razvoja kmetijstva in podeželja v Občini Hodoš"]
["KDM-028-5884284-2024","Občina Šoštanj",5884284000,"Pomoč de minimis za ohranjanje in razvoj kmetijstva, gozdarstva in podeželja v Občini Šoštanj","Pravilnik o ohranjanju in spodbujanju razvoja kmetijstva, gozdarstva in podeželja v Občini Šoštanj"]
["KDM-029-5874726-2024","Občina Črenšovci",5874726000,"Podpora ohranjanju oziroma povečevanju rodovitnosti tal na območju Občine Črenšovci","Pravilnik o ohranjanju in spodbujanju razvoja kmetijstva in podeželja v Občini Črenšovci"]
["KDM-030-5883237-2024","Občina Puconci",5883237000,"Podpora ohranjanju oziroma povečanju rodovitnosti tal na območju Občine Puconci","Pravilnik o ohranjanju in spodbujanju razvoja kmetijstva in podeželja v Občini Puconci"]
["KDM-031-1357883-2024","Občina Lovrenc na Pohorju",1357883000,"Podpora ohranjanju in povečevanju rodovitnosti tal v Občini Lovrenc na Pohorju","Pravilnik o ohranjanju in spodbujanju razvoja kmetijstva in podeželja v Občini Lovrenc na Pohorju"]
["KDM-032-5884276-2024","Občina Šmartno ob Paki",5884276000,"Pomoč za ohranjanje in spodbujanje razvoja kmetijstva, gozdarstva in podeželja v Občini Šmartno ob Paki","Pravilnik o ohranjanju in spodbujanju razvoja kmetijstva, gozdarstva in podeželja v Občini Šmartno ob Paki"]
["KDM-033-5880297-2024","Občina Radenci",5880297000,"Pomoč čebelarstvu v Občini Radenci","Pravilnik o ohranjanju in spodbujanju razvoja kmetijstva in podeželja v občini Radenci"]
["KDM-034-5883121-2024","Občina Kuzma",5883121000,"Podpora ohranjanju oziroma povečanju rodovitnosti tal na območju Občine Kuzma","Pravilnik o ohranjanju in spodbujanju razvoja kmetijstva in podeželja v Občini Kuzma"]
["KDM-035-2241153-2024","Občina Šentrupert",2241153000,"Podpora za tekoče poslovanje v primarni kmetijski proizvodnji v Občini Šentrupert","Pravilnik o ohranjanju in spodbujanju razvoja kmetijstva, gozdarstva in podeželja v Občini Šentrupert"]
["KDM-036-5874092-2024","Občina Ljutomer",5874092000,"Ohranjanje in spodbujanje razvoja kmetijstva, gozdarstva in podeželja v Občini Ljutomer","Pravilnik o ohranjanju in spodbujanju razvoja kmetijstva in podeželja v Občini Ljutomer"]
{"$rows_left_out":403}