{"text_format":"1","workbook":"xlsx","n_sheets":2,"sheets":["Obrazec preveritev in poročanje","Kode"],"not_rendered":{"charts":0,"images":0,"macros":1,"external_links":0,"defined_names":0,"comments":1,"pivot_tables":0},"unopened":[],"bounds":{"document_bytes":16777216,"sheet_cells":100000,"rows_first":2000,"rows_last":500,"rows_between":2000,"halvings":0,"cell_chars":16384,"cell_head_chars":4096},"cells_cut":0,"cells_raw":0,"read":"whole","date_system":"1900"}

{"sheet":"Obrazec preveritev in poročanje","index":0,"n_rows":205,"n_cols":24,"rows_kept":205,"cut":false,"hidden":false,"merged":[]}
["Naziv dajalca pomoči","Matična številka dajalca pomoči","Številka priglasitve","Naziv sheme pomoči de minimis ali individualne ad hoc pomoči de minimis","Matična številka prejemnika","Ime in priimek prejemnika ali naziv pravne osebe, ki je prejela pomoč","Davčna št.  prejemnika","KMG-MID-številka prejemnika","Naslov prejemnika (ime ulice in hišna številka, poštna številka in naziv pošte)","Šifra občine prejemnika","Datum odobritve pomoči","Datum nakazila pomoči prejemniku","Šifra instrumenta pomoči","Šifra namena pomoči","Opis ukrepa","Naložba\n(da/ne)","Vrednost celotne naložbe (EUR)","Pravna podlaga za odobritev pomoči","Pravni akt","Znesek upravičenih stroškov (EUR)","Bruto znesek pomoči \n(EUR)","Neto znesek \npomoči (EUR)","Število udeležencev","Stopnja intenzivnosti pomoči (%)"]
[null,{"$f":"VLOOKUP(A2,Kode!A2:C21,3,FALSE)","v":{"$error":"#N/A"}},{"$f":"VLOOKUP(A2,Kode!A2:B21,2,FALSE)","v":{"$error":"#N/A"}},{"$f":"VLOOKUP(A2,Kode!A2:D21,4,FALSE)","v":{"$error":"#N/A"}},null,null,null,null,null,null,null,null,null,null,null,null,null,{"$f":"VLOOKUP(A2,Kode!A2:E21,5,FALSE)","v":{"$error":"#N/A"}},null,null,null,null,null,{"$f":"V2/T2*100","v":{"$error":"#DIV/0!"}}]
[null,{"$f":"VLOOKUP(A3,Kode!A2:C21,3,FALSE)","v":{"$error":"#N/A"}},{"$f":"VLOOKUP(A3,Kode!A2:B21,2,FALSE)","v":{"$error":"#N/A"}},{"$f":"VLOOKUP(A3,Kode!A2:D21,4,FALSE)","v":{"$error":"#N/A"}},null,null,null,null,null,null,null,null,null,null,null,null,null,{"$f":"VLOOKUP(A3,Kode!A2:E21,5,FALSE)","v":{"$error":"#N/A"}},null,null,null,null,null,{"$f":"V3/T3*100","v":{"$error":"#DIV/0!"}}]
[null,{"$f":"VLOOKUP(A4,Kode!A2:C21,3,FALSE)","v":{"$error":"#N/A"}},{"$f":"VLOOKUP(A4,Kode!A2:B21,2,FALSE)","v":{"$error":"#N/A"}},{"$f":"VLOOKUP(A4,Kode!A2:D21,4,FALSE)","v":{"$error":"#N/A"}},null,null,null,null,null,null,null,null,null,null,null,null,null,{"$f":"VLOOKUP(A4,Kode!A2:E21,5,FALSE)","v":{"$error":"#N/A"}},null,null,null,null,null,{"$error":"#DIV/0!"}]
[null,{"$f":"VLOOKUP(A5,Kode!A2:C21,3,FALSE)","v":{"$error":"#N/A"}},{"$f":"VLOOKUP(A5,Kode!A2:B21,2,FALSE)","v":{"$error":"#N/A"}},{"$f":"VLOOKUP(A5,Kode!A2:D21,4,FALSE)","v":{"$error":"#N/A"}},null,null,null,null,null,null,null,null,null,null,null,null,null,{"$f":"VLOOKUP(A5,Kode!A2:E21,5,FALSE)","v":{"$error":"#N/A"}},null,null,null,null,null,{"$error":"#DIV/0!"}]
[null,{"$f":"VLOOKUP(A6,Kode!A2:C21,3,FALSE)","v":{"$error":"#N/A"}},{"$f":"VLOOKUP(A6,Kode!A2:B21,2,FALSE)","v":{"$error":"#N/A"}},{"$f":"VLOOKUP(A6,Kode!A2:D21,4,FALSE)","v":{"$error":"#N/A"}},null,null,null,null,null,null,null,null,null,null,null,null,null,{"$f":"VLOOKUP(A6,Kode!A2:E21,5,FALSE)","v":{"$error":"#N/A"}},null,null,null,null,null,{"$error":"#DIV/0!"}]
[null,{"$f":"VLOOKUP(A7,Kode!A2:C21,3,FALSE)","v":{"$error":"#N/A"}},{"$f":"VLOOKUP(A7,Kode!A2:B21,2,FALSE)","v":{"$error":"#N/A"}},{"$f":"VLOOKUP(A7,Kode!A2:D21,4,FALSE)","v":{"$error":"#N/A"}},null,null,null,null,null,null,null,null,null,null,null,null,null,{"$f":"VLOOKUP(A7,Kode!A2:E21,5,FALSE)","v":{"$error":"#N/A"}},null,null,null,null,null,{"$error":"#DIV/0!"}]
[null,{"$f":"VLOOKUP(A8,Kode!A2:C21,3,FALSE)","v":{"$error":"#N/A"}},{"$f":"VLOOKUP(A8,Kode!A2:B21,2,FALSE)","v":{"$error":"#N/A"}},{"$f":"VLOOKUP(A8,Kode!A2:D21,4,FALSE)","v":{"$error":"#N/A"}},null,null,null,null,null,null,null,null,null,null,null,null,null,{"$f":"VLOOKUP(A8,Kode!A2:E21,5,FALSE)","v":{"$error":"#N/A"}},null,null,null,null,null,{"$error":"#DIV/0!"}]
[null,{"$f":"VLOOKUP(A9,Kode!A2:C21,3,FALSE)","v":{"$error":"#N/A"}},{"$f":"VLOOKUP(A9,Kode!A2:B21,2,FALSE)","v":{"$error":"#N/A"}},{"$f":"VLOOKUP(A9,Kode!A2:D21,4,FALSE)","v":{"$error":"#N/A"}},null,null,null,null,null,null,null,null,null,null,null,null,null,{"$f":"VLOOKUP(A9,Kode!A2:E21,5,FALSE)","v":{"$error":"#N/A"}},null,null,null,null,null,{"$error":"#DIV/0!"}]
[null,{"$f":"VLOOKUP(A10,Kode!A2:C21,3,FALSE)","v":{"$error":"#N/A"}},{"$f":"VLOOKUP(A10,Kode!A2:B21,2,FALSE)","v":{"$error":"#N/A"}},{"$f":"VLOOKUP(A10,Kode!A2:D21,4,FALSE)","v":{"$error":"#N/A"}},null,null,null,null,null,null,null,null,null,null,null,null,null,{"$f":"VLOOKUP(A10,Kode!A2:E21,5,FALSE)","v":{"$error":"#N/A"}},null,null,null,null,null,{"$error":"#DIV/0!"}]
[null,{"$f":"VLOOKUP(A11,Kode!A2:C21,3,FALSE)","v":{"$error":"#N/A"}},{"$f":"VLOOKUP(A11,Kode!A2:B21,2,FALSE)","v":{"$error":"#N/A"}},{"$f":"VLOOKUP(A11,Kode!A2:D21,4,FALSE)","v":{"$error":"#N/A"}},null,null,null,null,null,null,null,null,null,null,null,null,null,{"$f":"VLOOKUP(A11,Kode!A2:E21,5,FALSE)","v":{"$error":"#N/A"}},null,null,null,null,null,{"$error":"#DIV/0!"}]
[null,{"$f":"VLOOKUP(A12,Kode!A2:C21,3,FALSE)","v":{"$error":"#N/A"}},{"$f":"VLOOKUP(A12,Kode!A2:B21,2,FALSE)","v":{"$error":"#N/A"}},{"$f":"VLOOKUP(A12,Kode!A2:D21,4,FALSE)","v":{"$error":"#N/A"}},null,null,null,null,null,null,null,null,null,null,null,null,null,{"$f":"VLOOKUP(A12,Kode!A2:E21,5,FALSE)","v":{"$error":"#N/A"}},null,null,null,null,null,{"$error":"#DIV/0!"}]
[null,{"$f":"VLOOKUP(A13,Kode!A2:C21,3,FALSE)","v":{"$error":"#N/A"}},{"$f":"VLOOKUP(A13,Kode!A2:B21,2,FALSE)","v":{"$error":"#N/A"}},{"$f":"VLOOKUP(A13,Kode!A2:D21,4,FALSE)","v":{"$error":"#N/A"}},null,null,null,null,null,null,null,null,null,null,null,null,null,{"$f":"VLOOKUP(A13,Kode!A2:E21,5,FALSE)","v":{"$error":"#N/A"}},null,null,null,null,null,{"$error":"#DIV/0!"}]
[null,{"$f":"VLOOKUP(A14,Kode!A2:C21,3,FALSE)","v":{"$error":"#N/A"}},{"$f":"VLOOKUP(A14,Kode!A2:B21,2,FALSE)","v":{"$error":"#N/A"}},{"$f":"VLOOKUP(A14,Kode!A2:D21,4,FALSE)","v":{"$error":"#N/A"}},null,null,null,null,null,null,null,null,null,null,null,null,null,{"$f":"VLOOKUP(A14,Kode!A2:E21,5,FALSE)","v":{"$error":"#N/A"}},null,null,null,null,null,{"$error":"#DIV/0!"}]
[null,{"$f":"VLOOKUP(A15,Kode!A2:C21,3,FALSE)","v":{"$error":"#N/A"}},{"$f":"VLOOKUP(A15,Kode!A2:B21,2,FALSE)","v":{"$error":"#N/A"}},{"$f":"VLOOKUP(A15,Kode!A2:D21,4,FALSE)","v":{"$error":"#N/A"}},null,null,null,null,null,null,null,null,null,null,null,null,null,{"$f":"VLOOKUP(A15,Kode!A2:E21,5,FALSE)","v":{"$error":"#N/A"}},null,null,null,null,null,{"$error":"#DIV/0!"}]
[null,{"$f":"VLOOKUP(A16,Kode!A2:C21,3,FALSE)","v":{"$error":"#N/A"}},{"$f":"VLOOKUP(A16,Kode!A2:B21,2,FALSE)","v":{"$error":"#N/A"}},{"$f":"VLOOKUP(A16,Kode!A2:D21,4,FALSE)","v":{"$error":"#N/A"}},null,null,null,null,null,null,null,null,null,null,null,null,null,{"$f":"VLOOKUP(A16,Kode!A2:E21,5,FALSE)","v":{"$error":"#N/A"}},null,null,null,null,null,{"$error":"#DIV/0!"}]
[null,{"$f":"VLOOKUP(A17,Kode!A2:C21,3,FALSE)","v":{"$error":"#N/A"}},{"$f":"VLOOKUP(A17,Kode!A2:B21,2,FALSE)","v":{"$error":"#N/A"}},{"$f":"VLOOKUP(A17,Kode!A2:D21,4,FALSE)","v":{"$error":"#N/A"}},null,null,null,null,null,null,null,null,null,null,null,null,null,{"$f":"VLOOKUP(A17,Kode!A2:E21,5,FALSE)","v":{"$error":"#N/A"}},null,null,null,null,null,{"$error":"#DIV/0!"}]
[null,{"$f":"VLOOKUP(A18,Kode!A2:C21,3,FALSE)","v":{"$error":"#N/A"}},{"$f":"VLOOKUP(A18,Kode!A2:B21,2,FALSE)","v":{"$error":"#N/A"}},{"$f":"VLOOKUP(A18,Kode!A2:D21,4,FALSE)","v":{"$error":"#N/A"}},null,null,null,null,null,null,null,null,null,null,null,null,null,{"$f":"VLOOKUP(A18,Kode!A2:E21,5,FALSE)","v":{"$error":"#N/A"}},null,null,null,null,null,{"$error":"#DIV/0!"}]
[null,{"$f":"VLOOKUP(A19,Kode!A2:C21,3,FALSE)","v":{"$error":"#N/A"}},{"$f":"VLOOKUP(A19,Kode!A2:B21,2,FALSE)","v":{"$error":"#N/A"}},{"$f":"VLOOKUP(A19,Kode!A2:D21,4,FALSE)","v":{"$error":"#N/A"}},null,null,null,null,null,null,null,null,null,null,null,null,null,{"$f":"VLOOKUP(A19,Kode!A2:E21,5,FALSE)","v":{"$error":"#N/A"}},null,null,null,null,null,{"$error":"#DIV/0!"}]
[null,{"$f":"VLOOKUP(A20,Kode!A2:C21,3,FALSE)","v":{"$error":"#N/A"}},{"$f":"VLOOKUP(A20,Kode!A2:B21,2,FALSE)","v":{"$error":"#N/A"}},{"$f":"VLOOKUP(A20,Kode!A2:D21,4,FALSE)","v":{"$error":"#N/A"}},null,null,null,null,null,null,null,null,null,null,null,null,null,{"$f":"VLOOKUP(A20,Kode!A2:E21,5,FALSE)","v":{"$error":"#N/A"}},null,null,null,null,null,{"$error":"#DIV/0!"}]
[null,{"$f":"VLOOKUP(A21,Kode!A2:C21,3,FALSE)","v":{"$error":"#N/A"}},{"$f":"VLOOKUP(A21,Kode!A2:B21,2,FALSE)","v":{"$error":"#N/A"}},{"$f":"VLOOKUP(A21,Kode!A2:D21,4,FALSE)","v":{"$error":"#N/A"}},null,null,null,null,null,null,null,null,null,null,null,null,null,{"$f":"VLOOKUP(A21,Kode!A2:E21,5,FALSE)","v":{"$error":"#N/A"}},null,null,null,null,null,{"$error":"#DIV/0!"}]
[null,{"$f":"VLOOKUP(A22,Kode!A2:C21,3,FALSE)","v":{"$error":"#N/A"}},{"$f":"VLOOKUP(A22,Kode!A2:B21,2,FALSE)","v":{"$error":"#N/A"}},{"$f":"VLOOKUP(A22,Kode!A2:D21,4,FALSE)","v":{"$error":"#N/A"}},null,null,null,null,null,null,null,null,null,null,null,null,null,{"$f":"VLOOKUP(A22,Kode!A2:E21,5,FALSE)","v":{"$error":"#N/A"}},null,null,null,null,null,{"$error":"#DIV/0!"}]
[null,{"$f":"VLOOKUP(A23,Kode!A2:C21,3,FALSE)","v":{"$error":"#N/A"}},{"$f":"VLOOKUP(A23,Kode!A2:B21,2,FALSE)","v":{"$error":"#N/A"}},{"$f":"VLOOKUP(A23,Kode!A2:D21,4,FALSE)","v":{"$error":"#N/A"}},null,null,null,null,null,null,null,null,null,null,null,null,null,{"$f":"VLOOKUP(A23,Kode!A2:E21,5,FALSE)","v":{"$error":"#N/A"}},null,null,null,null,null,{"$error":"#DIV/0!"}]
[null,{"$f":"VLOOKUP(A24,Kode!A2:C21,3,FALSE)","v":{"$error":"#N/A"}},{"$f":"VLOOKUP(A24,Kode!A2:B21,2,FALSE)","v":{"$error":"#N/A"}},{"$f":"VLOOKUP(A24,Kode!A2:D21,4,FALSE)","v":{"$error":"#N/A"}},null,null,null,null,null,null,null,null,null,null,null,null,null,{"$f":"VLOOKUP(A24,Kode!A2:E21,5,FALSE)","v":{"$error":"#N/A"}},null,null,null,null,null,{"$error":"#DIV/0!"}]
[null,{"$f":"VLOOKUP(A25,Kode!A2:C21,3,FALSE)","v":{"$error":"#N/A"}},{"$f":"VLOOKUP(A25,Kode!A2:B21,2,FALSE)","v":{"$error":"#N/A"}},{"$f":"VLOOKUP(A25,Kode!A2:D21,4,FALSE)","v":{"$error":"#N/A"}},null,null,null,null,null,null,null,null,null,null,null,null,null,{"$f":"VLOOKUP(A25,Kode!A2:E21,5,FALSE)","v":{"$error":"#N/A"}},null,null,null,null,null,{"$error":"#DIV/0!"}]
[null,{"$f":"VLOOKUP(A26,Kode!A2:C21,3,FALSE)","v":{"$error":"#N/A"}},{"$f":"VLOOKUP(A26,Kode!A2:B21,2,FALSE)","v":{"$error":"#N/A"}},{"$f":"VLOOKUP(A26,Kode!A2:D21,4,FALSE)","v":{"$error":"#N/A"}},null,null,null,null,null,null,null,null,null,null,null,null,null,{"$f":"VLOOKUP(A26,Kode!A2:E21,5,FALSE)","v":{"$error":"#N/A"}},null,null,null,null,null,{"$error":"#DIV/0!"}]
[null,{"$f":"VLOOKUP(A27,Kode!A2:C21,3,FALSE)","v":{"$error":"#N/A"}},{"$f":"VLOOKUP(A27,Kode!A2:B21,2,FALSE)","v":{"$error":"#N/A"}},{"$f":"VLOOKUP(A27,Kode!A2:D21,4,FALSE)","v":{"$error":"#N/A"}},null,null,null,null,null,null,null,null,null,null,null,null,null,{"$f":"VLOOKUP(A27,Kode!A2:E21,5,FALSE)","v":{"$error":"#N/A"}},null,null,null,null,null,{"$error":"#DIV/0!"}]
[null,{"$f":"VLOOKUP(A28,Kode!A2:C21,3,FALSE)","v":{"$error":"#N/A"}},{"$f":"VLOOKUP(A28,Kode!A2:B21,2,FALSE)","v":{"$error":"#N/A"}},{"$f":"VLOOKUP(A28,Kode!A2:D21,4,FALSE)","v":{"$error":"#N/A"}},null,null,null,null,null,null,null,null,null,null,null,null,null,{"$f":"VLOOKUP(A28,Kode!A2:E21,5,FALSE)","v":{"$error":"#N/A"}},null,null,null,null,null,{"$error":"#DIV/0!"}]
[null,{"$f":"VLOOKUP(A29,Kode!A2:C21,3,FALSE)","v":{"$error":"#N/A"}},{"$f":"VLOOKUP(A29,Kode!A2:B21,2,FALSE)","v":{"$error":"#N/A"}},{"$f":"VLOOKUP(A29,Kode!A2:D21,4,FALSE)","v":{"$error":"#N/A"}},null,null,null,null,null,null,null,null,null,null,null,null,null,{"$f":"VLOOKUP(A29,Kode!A2:E21,5,FALSE)","v":{"$error":"#N/A"}},null,null,null,null,null,{"$error":"#DIV/0!"}]
[null,{"$f":"VLOOKUP(A30,Kode!A2:C21,3,FALSE)","v":{"$error":"#N/A"}},{"$f":"VLOOKUP(A30,Kode!A2:B21,2,FALSE)","v":{"$error":"#N/A"}},{"$f":"VLOOKUP(A30,Kode!A2:D21,4,FALSE)","v":{"$error":"#N/A"}},null,null,null,null,null,null,null,null,null,null,null,null,null,{"$f":"VLOOKUP(A30,Kode!A2:E21,5,FALSE)","v":{"$error":"#N/A"}},null,null,null,null,null,{"$error":"#DIV/0!"}]
[null,{"$f":"VLOOKUP(A31,Kode!A2:C21,3,FALSE)","v":{"$error":"#N/A"}},{"$f":"VLOOKUP(A31,Kode!A2:B21,2,FALSE)","v":{"$error":"#N/A"}},{"$f":"VLOOKUP(A31,Kode!A2:D21,4,FALSE)","v":{"$error":"#N/A"}},null,null,null,null,null,null,null,null,null,null,null,null,null,{"$f":"VLOOKUP(A31,Kode!A2:E21,5,FALSE)","v":{"$error":"#N/A"}},null,null,null,null,null,{"$error":"#DIV/0!"}]
[null,{"$f":"VLOOKUP(A32,Kode!A2:C21,3,FALSE)","v":{"$error":"#N/A"}},{"$f":"VLOOKUP(A32,Kode!A2:B21,2,FALSE)","v":{"$error":"#N/A"}},{"$f":"VLOOKUP(A32,Kode!A2:D21,4,FALSE)","v":{"$error":"#N/A"}},null,null,null,null,null,null,null,null,null,null,null,null,null,{"$f":"VLOOKUP(A32,Kode!A2:E21,5,FALSE)","v":{"$error":"#N/A"}},null,null,null,null,null,{"$error":"#DIV/0!"}]
[null,{"$f":"VLOOKUP(A33,Kode!A2:C21,3,FALSE)","v":{"$error":"#N/A"}},{"$f":"VLOOKUP(A33,Kode!A2:B21,2,FALSE)","v":{"$error":"#N/A"}},{"$f":"VLOOKUP(A33,Kode!A2:D21,4,FALSE)","v":{"$error":"#N/A"}},null,null,null,null,null,null,null,null,null,null,null,null,null,{"$f":"VLOOKUP(A33,Kode!A2:E21,5,FALSE)","v":{"$error":"#N/A"}},null,null,null,null,null,{"$error":"#DIV/0!"}]
[null,{"$f":"VLOOKUP(A34,Kode!A2:C21,3,FALSE)","v":{"$error":"#N/A"}},{"$f":"VLOOKUP(A34,Kode!A2:B21,2,FALSE)","v":{"$error":"#N/A"}},{"$f":"VLOOKUP(A34,Kode!A2:D21,4,FALSE)","v":{"$error":"#N/A"}},null,null,null,null,null,null,null,null,null,null,null,null,null,{"$f":"VLOOKUP(A34,Kode!A2:E21,5,FALSE)","v":{"$error":"#N/A"}},null,null,null,null,null,{"$error":"#DIV/0!"}]
[null,{"$f":"VLOOKUP(A35,Kode!A2:C21,3,FALSE)","v":{"$error":"#N/A"}},{"$f":"VLOOKUP(A35,Kode!A2:B21,2,FALSE)","v":{"$error":"#N/A"}},{"$f":"VLOOKUP(A35,Kode!A2:D21,4,FALSE)","v":{"$error":"#N/A"}},null,null,null,null,null,null,null,null,null,null,null,null,null,{"$f":"VLOOKUP(A35,Kode!A2:E21,5,FALSE)","v":{"$error":"#N/A"}},null,null,null,null,null,{"$error":"#DIV/0!"}]
[null,{"$f":"VLOOKUP(A36,Kode!A2:C21,3,FALSE)","v":{"$error":"#N/A"}},{"$f":"VLOOKUP(A36,Kode!A2:B21,2,FALSE)","v":{"$error":"#N/A"}},{"$f":"VLOOKUP(A36,Kode!A2:D21,4,FALSE)","v":{"$error":"#N/A"}},null,null,null,null,null,null,null,null,null,null,null,null,null,{"$f":"VLOOKUP(A36,Kode!A2:E21,5,FALSE)","v":{"$error":"#N/A"}},null,null,null,null,null,{"$error":"#DIV/0!"}]
[null,{"$f":"VLOOKUP(A37,Kode!A2:C21,3,FALSE)","v":{"$error":"#N/A"}},{"$f":"VLOOKUP(A37,Kode!A2:B21,2,FALSE)","v":{"$error":"#N/A"}},{"$f":"VLOOKUP(A37,Kode!A2:D21,4,FALSE)","v":{"$error":"#N/A"}},null,null,null,null,null,null,null,null,null,null,null,null,null,{"$f":"VLOOKUP(A37,Kode!A2:E21,5,FALSE)","v":{"$error":"#N/A"}},null,null,null,null,null,{"$error":"#DIV/0!"}]
[null,{"$f":"VLOOKUP(A38,Kode!A2:C21,3,FALSE)","v":{"$error":"#N/A"}},{"$f":"VLOOKUP(A38,Kode!A2:B21,2,FALSE)","v":{"$error":"#N/A"}},{"$f":"VLOOKUP(A38,Kode!A2:D21,4,FALSE)","v":{"$error":"#N/A"}},null,null,null,null,null,null,null,null,null,null,null,null,null,{"$f":"VLOOKUP(A38,Kode!A2:E21,5,FALSE)","v":{"$error":"#N/A"}},null,null,null,null,null,{"$error":"#DIV/0!"}]
[null,{"$f":"VLOOKUP(A39,Kode!A2:C21,3,FALSE)","v":{"$error":"#N/A"}},{"$f":"VLOOKUP(A39,Kode!A2:B21,2,FALSE)","v":{"$error":"#N/A"}},{"$f":"VLOOKUP(A39,Kode!A2:D21,4,FALSE)","v":{"$error":"#N/A"}},null,null,null,null,null,null,null,null,null,null,null,null,null,{"$f":"VLOOKUP(A39,Kode!A2:E21,5,FALSE)","v":{"$error":"#N/A"}},null,null,null,null,null,{"$error":"#DIV/0!"}]
[null,{"$f":"VLOOKUP(A40,Kode!A2:C21,3,FALSE)","v":{"$error":"#N/A"}},{"$f":"VLOOKUP(A40,Kode!A2:B21,2,FALSE)","v":{"$error":"#N/A"}},{"$f":"VLOOKUP(A40,Kode!A2:D21,4,FALSE)","v":{"$error":"#N/A"}},null,null,null,null,null,null,null,null,null,null,null,null,null,{"$f":"VLOOKUP(A40,Kode!A2:E21,5,FALSE)","v":{"$error":"#N/A"}},null,null,null,null,null,{"$error":"#DIV/0!"}]
{"$rows_left_out":166}
{"sheet":"Kode","index":1,"n_rows":434,"n_cols":11,"rows_kept":434,"cut":false,"hidden":true,"merged":[]}
["Naziv dajalca pomoči","Št. Priglasitve","MŠ dajalca pomoči","Naziv sheme pomoči/ime prejemnika individualne ad hoc pomoči","Pravna podlaga sheme pomoči","Šifra občine","Šifra instrumenta","Šifra namena","Opis ukrepa","Investicija","Člen uredbe"]
["JEKO, d. o. o.","K-M011-2482789-2015",5926823000,"Nadomestilo za zmanjšanje dohodka iz kmetijske dejavnosti zaradi prilagoditve ukrepom vodovarstvenega režima - de minimis","Uredba o načinu izplačevanja in merilih za izračun nadomestila za zmanjšanje dohodka iz kmetijske dejavnosti zaradi prilagoditve ukrepom vodovarstvenega režima",null,1,"5.0.04.1","a","da",14]
["JKP Brezovica d. o. o.","K-M011-2482789-2015",5945151000,"Nadomestilo za zmanjšanje dohodka iz kmetijske dejavnosti zaradi prilagoditve ukrepom vodovarstvenega režima - de minimis","Uredba o načinu izplačevanja in merilih za izračun nadomestila za zmanjšanje dohodka iz kmetijske dejavnosti zaradi prilagoditve ukrepom vodovarstvenega režima",null,5,"5.0.04.2","b","ne",15]
["JKP Žalec, d. o. o.","K-M011-2482789-2015",5068134000,"Nadomestilo za zmanjšanje dohodka iz kmetijske dejavnosti zaradi prilagoditve ukrepom vodovarstvenega režima - de minimis","Uredba o načinu izplačevanja in merilih za izračun nadomestila za zmanjšanje dohodka iz kmetijske dejavnosti zaradi prilagoditve ukrepom vodovarstvenega režima",null,10,"5.0.04.4","c",null,16]
["JP Komunala Črnomelj d. o. o.","K-M011-2482789-2015",5062403000,"Nadomestilo za zmanjšanje dohodka iz kmetijske dejavnosti zaradi prilagoditve ukrepom vodovarstvenega režima - de minimis","Uredba o načinu izplačevanja in merilih za izračun nadomestila za zmanjšanje dohodka iz kmetijske dejavnosti zaradi prilagoditve ukrepom vodovarstvenega režima",null,20,"5.0.04.5","d",null,17]
["JP KPV, d. o. o.","K-M011-2482789-2015",5015707000,"Nadomestilo za zmanjšanje dohodka iz kmetijske dejavnosti zaradi prilagoditve ukrepom vodovarstvenega režima - de minimis","Uredba o načinu izplačevanja in merilih za izračun nadomestila za zmanjšanje dohodka iz kmetijske dejavnosti zaradi prilagoditve ukrepom vodovarstvenega režima",null,25,"5.0.07.0","e",null,21]
["JP VOKA SNAGA d. o. o.","K-M011-2482789-2015",5046688000,"Nadomestilo za zmanjšanje dohodka iz kmetijske dejavnosti zaradi prilagoditve ukrepom vodovarstvenega režima - de minimis","Uredba o načinu izplačevanja in merilih za izračun nadomestila za zmanjšanje dohodka iz kmetijske dejavnosti zaradi prilagoditve ukrepom vodovarstvenega režima",null,28,"5.0.10.0","f",null,24]
["Komunala Kranj d. o. o.","K-M011-2482789-2015",5067731000,"Nadomestilo za zmanjšanje dohodka iz kmetijske dejavnosti zaradi prilagoditve ukrepom vodovarstvenega režima - de minimis","Uredba o načinu izplačevanja in merilih za izračun nadomestila za zmanjšanje dohodka iz kmetijske dejavnosti zaradi prilagoditve ukrepom vodovarstvenega režima",null,40,"5.0.11.2","g",null,28]
["Komunala Metlika d. o. o.","K-M011-2482789-2015",5157064000,"Nadomestilo za zmanjšanje dohodka iz kmetijske dejavnosti zaradi prilagoditve ukrepom vodovarstvenega režima - de minimis","Uredba o načinu izplačevanja in merilih za izračun nadomestila za zmanjšanje dohodka iz kmetijske dejavnosti zaradi prilagoditve ukrepom vodovarstvenega režima",null,43,"5.0.11.3","h",null,29]
["Komunala Ptuj d. d.","K-M011-2482789-2015",5321387000,"Nadomestilo za zmanjšanje dohodka iz kmetijske dejavnosti zaradi prilagoditve ukrepom vodovarstvenega režima - de minimis","Uredba o načinu izplačevanja in merilih za izračun nadomestila za zmanjšanje dohodka iz kmetijske dejavnosti zaradi prilagoditve ukrepom vodovarstvenega režima",null,48,"5.0.11.4",null,null,38]
["Komunala Radgona d. o. o.","K-M011-2482789-2015",2117975000,"Nadomestilo za zmanjšanje dohodka iz kmetijske dejavnosti zaradi prilagoditve ukrepom vodovarstvenega režima - de minimis","Uredba o načinu izplačevanja in merilih za izračun nadomestila za zmanjšanje dohodka iz kmetijske dejavnosti zaradi prilagoditve ukrepom vodovarstvenega režima",null,50,"5.0.11.5",null,null,43]
["Komunala Slovenj Gradec, d. o. o.","K-M011-2482789-2015",5072107000,"Nadomestilo za zmanjšanje dohodka iz kmetijske dejavnosti zaradi prilagoditve ukrepom vodovarstvenega režima - de minimis","Uredba o načinu izplačevanja in merilih za izračun nadomestila za zmanjšanje dohodka iz kmetijske dejavnosti zaradi prilagoditve ukrepom vodovarstvenega režima",null,70,"5.0.12.0"]
["Komunala Slovenska Bistrica d. o. o.","K-M011-2482789-2015",5073162000,"Nadomestilo za zmanjšanje dohodka iz kmetijske dejavnosti zaradi prilagoditve ukrepom vodovarstvenega režima - de minimis","Uredba o načinu izplačevanja in merilih za izračun nadomestila za zmanjšanje dohodka iz kmetijske dejavnosti zaradi prilagoditve ukrepom vodovarstvenega režima",null,75,"5.0.13.0"]
["Komunalno podjetje Logatec, d. o. o.","K-M011-2482789-2015",5827558000,"Nadomestilo za zmanjšanje dohodka iz kmetijske dejavnosti zaradi prilagoditve ukrepom vodovarstvenega režima - de minimis","Uredba o načinu izplačevanja in merilih za izračun nadomestila za zmanjšanje dohodka iz kmetijske dejavnosti zaradi prilagoditve ukrepom vodovarstvenega režima",null,null,"5.0.14.1"]
["Kraški vodovod Sežana d. o. o.","K-M011-2482789-2015",5072999000,"Nadomestilo za zmanjšanje dohodka iz kmetijske dejavnosti zaradi prilagoditve ukrepom vodovarstvenega režima - de minimis","Uredba o načinu izplačevanja in merilih za izračun nadomestila za zmanjšanje dohodka iz kmetijske dejavnosti zaradi prilagoditve ukrepom vodovarstvenega režima",null,null,"5.0.14.2"]
["KS Brezovica","K-M011-2482789-2015",5029970000,"Nadomestilo za zmanjšanje dohodka iz kmetijske dejavnosti zaradi prilagoditve ukrepom vodovarstvenega režima - de minimis","Uredba o načinu izplačevanja in merilih za izračun nadomestila za zmanjšanje dohodka iz kmetijske dejavnosti zaradi prilagoditve ukrepom vodovarstvenega režima",null,null,"5.0.14.3"]
["Mariborski vodovod d. d.","K-M011-2482789-2015",5067880000,"Nadomestilo za zmanjšanje dohodka iz kmetijske dejavnosti zaradi prilagoditve ukrepom vodovarstvenega režima - de minimis","Uredba o načinu izplačevanja in merilih za izračun nadomestila za zmanjšanje dohodka iz kmetijske dejavnosti zaradi prilagoditve ukrepom vodovarstvenega režima",null,null,"5.0.14.4"]
["Občina Hoče - Slivnica","K-M011-2482789-2015",1365568000,"Nadomestilo za zmanjšanje dohodka iz kmetijske dejavnosti zaradi prilagoditve ukrepom vodovarstvenega režima - de minimis","Uredba o načinu izplačevanja in merilih za izračun nadomestila za zmanjšanje dohodka iz kmetijske dejavnosti zaradi prilagoditve ukrepom vodovarstvenega režima",null,null,"5.0.15.0"]
["Občina Ig","K-M011-2482789-2015",5874769000,"Nadomestilo za zmanjšanje dohodka iz kmetijske dejavnosti zaradi prilagoditve ukrepom vodovarstvenega režima - de minimis","Uredba o načinu izplačevanja in merilih za izračun nadomestila za zmanjšanje dohodka iz kmetijske dejavnosti zaradi prilagoditve ukrepom vodovarstvenega režima",null,null,"5.1.01.0"]
["Rižanski vodovod Koper d. o. o. - s. r. l.","K-M011-2482789-2015",5067782000,"Nadomestilo za zmanjšanje dohodka iz kmetijske dejavnosti zaradi prilagoditve ukrepom vodovarstvenega režima - de minimis","Uredba o načinu izplačevanja in merilih za izračun nadomestila za zmanjšanje dohodka iz kmetijske dejavnosti zaradi prilagoditve ukrepom vodovarstvenega režima",null,null,"5.1.02.0"]
["Vodovod - kanalizacija, d. o. o.","K-M011-2482789-2015",5914540000,"Nadomestilo za zmanjšanje dohodka iz kmetijske dejavnosti zaradi prilagoditve ukrepom vodovarstvenega režima - de minimis","Uredba o načinu izplačevanja in merilih za izračun nadomestila za zmanjšanje dohodka iz kmetijske dejavnosti zaradi prilagoditve ukrepom vodovarstvenega režima",null,null,"5.1.03.0"]
[null,null,null,null,null,null,null,"5.1.04.0"]
[null,null,null,null,null,null,null,"5.1.05.0"]
[null,null,null,null,null,null,null,"5.1.06.0"]
[null,null,null,null,null,null,null,"5.2.01.0"]
[null,null,null,null,null,null,null,"5.2.02.0"]
[null,null,null,null,null,null,null,"5.7.00.0"]
[null,null,null,null,null,null,null,"5.8.01.0"]
[null,null,null,null,null,null,null,"5.8.02.0"]
[null,null,null,null,null,null,null,"5.8.03.0"]
[null,null,null,null,null,null,null,"5.8.04.0"]
[null,null,null,null,null,null,null,"5.8.05.0"]
[null,null,null,null,null,null,null,"5.8.06.0"]
[null,null,null,null,null,null,null,"5.8.07.1"]
[null,null,null,null,null,null,null,"5.8.07.2"]
[null,null,null,null,null,null,null,"5.8.08.0"]
[null,null,null,null,null,null,null,"5.8.09.0"]
[null,null,null,null,null,null,null,"5.8.10.0"]
[null,null,null,null,null,null,null,"5.8.11.0"]
[]
{"$rows_left_out":394}