{"text_format":"1","workbook":"xlsx","n_sheets":2,"sheets":["Poročilo o izplačani DP","Kode"],"not_rendered":{"charts":0,"images":0,"macros":1,"external_links":0,"defined_names":2,"comments":1,"pivot_tables":0},"unopened":[],"bounds":{"document_bytes":16777216,"sheet_cells":100000,"rows_first":2000,"rows_last":500,"rows_between":2000,"halvings":0,"cell_chars":16384,"cell_head_chars":4096},"cells_cut":0,"cells_raw":0,"read":"whole","date_system":"1900"}

{"sheet":"Poročilo o izplačani DP","index":0,"n_rows":1000,"n_cols":25,"rows_kept":1000,"cut":false,"hidden":false,"merged":[]}
["Matična številka dajalca pomoči","Evropska identifikacijska številka sheme državne pomoči","Naziv sheme državne pomoči","Matična številka upravičenca","Ime in priimek upravičenca ali naziv pravne osebe, ki je upravičena do pomoči","Davčna št.  upravičenca","KMG-MID-številka upravičenca","Naslov upravičenca (ime ulice in hišna številka, poštna številka in naziv pošte)","Šifra občine upravičenca","Datum odobritve pomoči","Datum nakazila pomoči upravičencu","Šifra instrumenta pomoči","Šifra namena pomoči","Opis ukrepa","Naložba\n(da/ne)","Vrednost celotne naložbe (EUR)","Pravna podlaga za odobritev pomoči","Naziv, številka in datum pravnega akta, s katerim je upravičencu pomoč dodeljena","Znesek upravičenih stroškov (EUR)","Bruto znesek pomoči \n(EUR)","Neto znesek \npomoči (EUR)","Število udeležencev","Člen Uredbe EU št. 702/2014 ali 2022/2472 ali oddelek smernic","Šifra dejavnosti, za katero je pomoč dodeljena","Stopnja intenzivnosti pomoči (%)"]
[{"$f":"VLOOKUP(B2,Kode!A2:C215,3,FALSE)","v":{"$error":"#N/A"}},null,{"$f":"VLOOKUP(B2,Kode!A2:D215,4,FALSE)","v":{"$error":"#N/A"}},null,null,null,null,null,null,null,null,null,null,null,null,null,{"$f":"VLOOKUP(B2,Kode!A2:E215,5,FALSE)","v":{"$error":"#N/A"}},null,null,null,null,null,null,null,{"$f":"U2/S2*100","v":{"$error":"#DIV/0!"}}]
[{"$f":"VLOOKUP(B3,Kode!A2:C215,3,FALSE)","v":{"$error":"#N/A"}},null,{"$f":"VLOOKUP(B3,Kode!A2:D215,4,FALSE)","v":{"$error":"#N/A"}},null,null,null,null,null,null,null,null,null,null,null,null,null,{"$f":"VLOOKUP(B3,Kode!A2:E215,5,FALSE)","v":{"$error":"#N/A"}},null,null,null,null,null,null,null,{"$f":"U3/S3*100","v":{"$error":"#DIV/0!"}}]
[{"$f":"VLOOKUP(B4,Kode!A2:C215,3,FALSE)","v":{"$error":"#N/A"}},null,{"$f":"VLOOKUP(B4,Kode!A2:D215,4,FALSE)","v":{"$error":"#N/A"}},null,null,null,null,null,null,null,null,null,null,null,null,null,{"$f":"VLOOKUP(B4,Kode!A2:E215,5,FALSE)","v":{"$error":"#N/A"}},null,null,null,null,null,null,null,{"$error":"#DIV/0!"}]
[{"$f":"VLOOKUP(B5,Kode!A2:C215,3,FALSE)","v":{"$error":"#N/A"}},null,{"$f":"VLOOKUP(B5,Kode!A2:D215,4,FALSE)","v":{"$error":"#N/A"}},null,null,null,null,null,null,null,null,null,null,null,null,null,{"$f":"VLOOKUP(B5,Kode!A2:E215,5,FALSE)","v":{"$error":"#N/A"}},null,null,null,null,null,null,null,{"$error":"#DIV/0!"}]
[{"$f":"VLOOKUP(B6,Kode!A2:C215,3,FALSE)","v":{"$error":"#N/A"}},null,{"$f":"VLOOKUP(B6,Kode!A2:D215,4,FALSE)","v":{"$error":"#N/A"}},null,null,null,null,null,null,null,null,null,null,null,null,null,{"$f":"VLOOKUP(B6,Kode!A2:E215,5,FALSE)","v":{"$error":"#N/A"}},null,null,null,null,null,null,null,{"$error":"#DIV/0!"}]
[{"$f":"VLOOKUP(B7,Kode!A2:C215,3,FALSE)","v":{"$error":"#N/A"}},null,{"$f":"VLOOKUP(B7,Kode!A2:D215,4,FALSE)","v":{"$error":"#N/A"}},null,null,null,null,null,null,null,null,null,null,null,null,null,{"$f":"VLOOKUP(B7,Kode!A2:E215,5,FALSE)","v":{"$error":"#N/A"}},null,null,null,null,null,null,null,{"$error":"#DIV/0!"}]
[{"$f":"VLOOKUP(B8,Kode!A2:C215,3,FALSE)","v":{"$error":"#N/A"}},null,{"$f":"VLOOKUP(B8,Kode!A2:D215,4,FALSE)","v":{"$error":"#N/A"}},null,null,null,null,null,null,null,null,null,null,null,null,null,{"$f":"VLOOKUP(B8,Kode!A2:E215,5,FALSE)","v":{"$error":"#N/A"}},null,null,null,null,null,null,null,{"$error":"#DIV/0!"}]
[{"$f":"VLOOKUP(B9,Kode!A2:C215,3,FALSE)","v":{"$error":"#N/A"}},null,{"$f":"VLOOKUP(B9,Kode!A2:D215,4,FALSE)","v":{"$error":"#N/A"}},null,null,null,null,null,null,null,null,null,null,null,null,null,{"$f":"VLOOKUP(B9,Kode!A2:E215,5,FALSE)","v":{"$error":"#N/A"}},null,null,null,null,null,null,null,{"$error":"#DIV/0!"}]
[{"$f":"VLOOKUP(B10,Kode!A2:C215,3,FALSE)","v":{"$error":"#N/A"}},null,{"$f":"VLOOKUP(B10,Kode!A2:D215,4,FALSE)","v":{"$error":"#N/A"}},null,null,null,null,null,null,null,null,null,null,null,null,null,{"$f":"VLOOKUP(B10,Kode!A2:E215,5,FALSE)","v":{"$error":"#N/A"}},null,null,null,null,null,null,null,{"$error":"#DIV/0!"}]
[{"$f":"VLOOKUP(B11,Kode!A2:C215,3,FALSE)","v":{"$error":"#N/A"}},null,{"$f":"VLOOKUP(B11,Kode!A2:D215,4,FALSE)","v":{"$error":"#N/A"}},null,null,null,null,null,null,null,null,null,null,null,null,null,{"$f":"VLOOKUP(B11,Kode!A2:E215,5,FALSE)","v":{"$error":"#N/A"}},null,null,null,null,null,null,null,{"$error":"#DIV/0!"}]
[{"$f":"VLOOKUP(B12,Kode!A2:C215,3,FALSE)","v":{"$error":"#N/A"}},null,{"$f":"VLOOKUP(B12,Kode!A2:D215,4,FALSE)","v":{"$error":"#N/A"}},null,null,null,null,null,null,null,null,null,null,null,null,null,{"$f":"VLOOKUP(B12,Kode!A2:E215,5,FALSE)","v":{"$error":"#N/A"}},null,null,null,null,null,null,null,{"$error":"#DIV/0!"}]
[{"$f":"VLOOKUP(B13,Kode!A2:C215,3,FALSE)","v":{"$error":"#N/A"}},null,{"$f":"VLOOKUP(B13,Kode!A2:D215,4,FALSE)","v":{"$error":"#N/A"}},null,null,null,null,null,null,null,null,null,null,null,null,null,{"$f":"VLOOKUP(B13,Kode!A2:E215,5,FALSE)","v":{"$error":"#N/A"}},null,null,null,null,null,null,null,{"$error":"#DIV/0!"}]
[{"$f":"VLOOKUP(B14,Kode!A2:C215,3,FALSE)","v":{"$error":"#N/A"}},null,{"$f":"VLOOKUP(B14,Kode!A2:D215,4,FALSE)","v":{"$error":"#N/A"}},null,null,null,null,null,null,null,null,null,null,null,null,null,{"$f":"VLOOKUP(B14,Kode!A2:E215,5,FALSE)","v":{"$error":"#N/A"}},null,null,null,null,null,null,null,{"$error":"#DIV/0!"}]
[{"$f":"VLOOKUP(B15,Kode!A2:C215,3,FALSE)","v":{"$error":"#N/A"}},null,{"$f":"VLOOKUP(B15,Kode!A2:D215,4,FALSE)","v":{"$error":"#N/A"}},null,null,null,null,null,null,null,null,null,null,null,null,null,{"$f":"VLOOKUP(B15,Kode!A2:E215,5,FALSE)","v":{"$error":"#N/A"}},null,null,null,null,null,null,null,{"$error":"#DIV/0!"}]
[{"$f":"VLOOKUP(B16,Kode!A2:C215,3,FALSE)","v":{"$error":"#N/A"}},null,{"$f":"VLOOKUP(B16,Kode!A2:D215,4,FALSE)","v":{"$error":"#N/A"}},null,null,null,null,null,null,null,null,null,null,null,null,null,{"$f":"VLOOKUP(B16,Kode!A2:E215,5,FALSE)","v":{"$error":"#N/A"}},null,null,null,null,null,null,null,{"$error":"#DIV/0!"}]
[{"$f":"VLOOKUP(B17,Kode!A2:C215,3,FALSE)","v":{"$error":"#N/A"}},null,{"$f":"VLOOKUP(B17,Kode!A2:D215,4,FALSE)","v":{"$error":"#N/A"}},null,null,null,null,null,null,null,null,null,null,null,null,null,{"$f":"VLOOKUP(B17,Kode!A2:E215,5,FALSE)","v":{"$error":"#N/A"}},null,null,null,null,null,null,null,{"$error":"#DIV/0!"}]
[{"$f":"VLOOKUP(B18,Kode!A2:C215,3,FALSE)","v":{"$error":"#N/A"}},null,{"$f":"VLOOKUP(B18,Kode!A2:D215,4,FALSE)","v":{"$error":"#N/A"}},null,null,null,null,null,null,null,null,null,null,null,null,null,{"$f":"VLOOKUP(B18,Kode!A2:E215,5,FALSE)","v":{"$error":"#N/A"}},null,null,null,null,null,null,null,{"$error":"#DIV/0!"}]
[{"$f":"VLOOKUP(B19,Kode!A2:C215,3,FALSE)","v":{"$error":"#N/A"}},null,{"$f":"VLOOKUP(B19,Kode!A2:D215,4,FALSE)","v":{"$error":"#N/A"}},null,null,null,null,null,null,null,null,null,null,null,null,null,{"$f":"VLOOKUP(B19,Kode!A2:E215,5,FALSE)","v":{"$error":"#N/A"}},null,null,null,null,null,null,null,{"$error":"#DIV/0!"}]
[{"$f":"VLOOKUP(B20,Kode!A2:C215,3,FALSE)","v":{"$error":"#N/A"}},null,{"$f":"VLOOKUP(B20,Kode!A2:D215,4,FALSE)","v":{"$error":"#N/A"}},null,null,null,null,null,null,null,null,null,null,null,null,null,{"$f":"VLOOKUP(B20,Kode!A2:E215,5,FALSE)","v":{"$error":"#N/A"}},null,null,null,null,null,null,null,{"$error":"#DIV/0!"}]
[{"$f":"VLOOKUP(B21,Kode!A2:C215,3,FALSE)","v":{"$error":"#N/A"}},null,{"$f":"VLOOKUP(B21,Kode!A2:D215,4,FALSE)","v":{"$error":"#N/A"}},null,null,null,null,null,null,null,null,null,null,null,null,null,{"$f":"VLOOKUP(B21,Kode!A2:E215,5,FALSE)","v":{"$error":"#N/A"}},null,null,null,null,null,null,null,{"$error":"#DIV/0!"}]
[{"$f":"VLOOKUP(B22,Kode!A2:C215,3,FALSE)","v":{"$error":"#N/A"}},null,{"$f":"VLOOKUP(B22,Kode!A2:D215,4,FALSE)","v":{"$error":"#N/A"}},null,null,null,null,null,null,null,null,null,null,null,null,null,{"$f":"VLOOKUP(B22,Kode!A2:E215,5,FALSE)","v":{"$error":"#N/A"}},null,null,null,null,null,null,null,{"$error":"#DIV/0!"}]
[{"$f":"VLOOKUP(B23,Kode!A2:C215,3,FALSE)","v":{"$error":"#N/A"}},null,{"$f":"VLOOKUP(B23,Kode!A2:D215,4,FALSE)","v":{"$error":"#N/A"}},null,null,null,null,null,null,null,null,null,null,null,null,null,{"$f":"VLOOKUP(B23,Kode!A2:E215,5,FALSE)","v":{"$error":"#N/A"}},null,null,null,null,null,null,null,{"$error":"#DIV/0!"}]
[{"$f":"VLOOKUP(B24,Kode!A2:C215,3,FALSE)","v":{"$error":"#N/A"}},null,{"$f":"VLOOKUP(B24,Kode!A2:D215,4,FALSE)","v":{"$error":"#N/A"}},null,null,null,null,null,null,null,null,null,null,null,null,null,{"$f":"VLOOKUP(B24,Kode!A2:E215,5,FALSE)","v":{"$error":"#N/A"}},null,null,null,null,null,null,null,{"$error":"#DIV/0!"}]
[{"$f":"VLOOKUP(B25,Kode!A2:C215,3,FALSE)","v":{"$error":"#N/A"}},null,{"$f":"VLOOKUP(B25,Kode!A2:D215,4,FALSE)","v":{"$error":"#N/A"}},null,null,null,null,null,null,null,null,null,null,null,null,null,{"$f":"VLOOKUP(B25,Kode!A2:E215,5,FALSE)","v":{"$error":"#N/A"}},null,null,null,null,null,null,null,{"$error":"#DIV/0!"}]
[{"$f":"VLOOKUP(B26,Kode!A2:C215,3,FALSE)","v":{"$error":"#N/A"}},null,{"$f":"VLOOKUP(B26,Kode!A2:D215,4,FALSE)","v":{"$error":"#N/A"}},null,null,null,null,null,null,null,null,null,null,null,null,null,{"$f":"VLOOKUP(B26,Kode!A2:E215,5,FALSE)","v":{"$error":"#N/A"}},null,null,null,null,null,null,null,{"$error":"#DIV/0!"}]
[{"$f":"VLOOKUP(B27,Kode!A2:C215,3,FALSE)","v":{"$error":"#N/A"}},null,{"$f":"VLOOKUP(B27,Kode!A2:D215,4,FALSE)","v":{"$error":"#N/A"}},null,null,null,null,null,null,null,null,null,null,null,null,null,{"$f":"VLOOKUP(B27,Kode!A2:E215,5,FALSE)","v":{"$error":"#N/A"}},null,null,null,null,null,null,null,{"$error":"#DIV/0!"}]
[{"$f":"VLOOKUP(B28,Kode!A2:C215,3,FALSE)","v":{"$error":"#N/A"}},null,{"$f":"VLOOKUP(B28,Kode!A2:D215,4,FALSE)","v":{"$error":"#N/A"}},null,null,null,null,null,null,null,null,null,null,null,null,null,{"$f":"VLOOKUP(B28,Kode!A2:E215,5,FALSE)","v":{"$error":"#N/A"}},null,null,null,null,null,null,null,{"$error":"#DIV/0!"}]
[{"$f":"VLOOKUP(B29,Kode!A2:C215,3,FALSE)","v":{"$error":"#N/A"}},null,{"$f":"VLOOKUP(B29,Kode!A2:D215,4,FALSE)","v":{"$error":"#N/A"}},null,null,null,null,null,null,null,null,null,null,null,null,null,{"$f":"VLOOKUP(B29,Kode!A2:E215,5,FALSE)","v":{"$error":"#N/A"}},null,null,null,null,null,null,null,{"$error":"#DIV/0!"}]
[{"$f":"VLOOKUP(B30,Kode!A2:C215,3,FALSE)","v":{"$error":"#N/A"}},null,{"$f":"VLOOKUP(B30,Kode!A2:D215,4,FALSE)","v":{"$error":"#N/A"}},null,null,null,null,null,null,null,null,null,null,null,null,null,{"$f":"VLOOKUP(B30,Kode!A2:E215,5,FALSE)","v":{"$error":"#N/A"}},null,null,null,null,null,null,null,{"$error":"#DIV/0!"}]
{"$rows_left_out":971}
{"sheet":"Kode","index":1,"n_rows":213,"n_cols":12,"rows_kept":213,"cut":false,"hidden":true,"merged":[]}
["ID sheme pomoči","Kratek naziv sheme","MŠ dajalca pomoči","Naziv sheme pomoči","Pravna podlaga sheme pomoči","Šifra občine","Šifra instrumenta","Šifra namena","Opis ukrepa","Investicija","Člen uredbe","Šifra dejavnosti"]
["SA.44248 (2016/XA)","MKGP - žledolom (PRP)",2399253000,"Odprava škode v gozdovih zaradi žledoloma, PRP 2014–2020","Uredba o ukrepih za sanacijo in obnovo gozda po naravni nesreči žledu med 30. januarjem in 10. februarjem 2014 iz Programa razvoja podeželja Republike Slovenije za obdobje 2014–2020","001",1,"5.0.04.1","a","da",14,"01.1"]
["SA.51965 (2018/XA)","MKGP - podlubniki (PRP) - do 2019",2399253000,"Odprava škode v gozdovih zaradi napada prenamnoženih populacij podlubnikov kot posledica žledoloma – PRP 2014–2020 ","Uredba o ukrepih za sanacijo in obnovo gozda po naravni nesreči žledu med 30. januarjem in 10. februarjem 2014 iz Programa razvoja podeželja Republike Slovenije za obdobje 2014–2020","002",5,"5.0.04.2","b","ne",15,"01.2"]
["SA.52268 (2018/N)","MKGP - sodelovanje v gozdarstvu (PRP)",2399253000,"Pomoč za sodelovanje v gozdarskem sektorju PRP 2014–2020 ","Uredba o izvajanju ukrepa Sodelovanje iz Programa razvoja podeželja Republike Slovenije za obdobje 2014–2020","003",10,"5.0.04.4","c",null,16,"01.3"]
["SA.52702 (2018/XA)","MKGP - vetrolom 2017 (PRP)",2399253000,"Odprava škode v gozdovih zaradi vetroloma v letu 2017 iz PRP 2014–2020 ","Uredba o ukrepih za sanacijo in obnovo gozda po naravni nesreči vetrolomu iz Programa razvoja podeželja Republike Slovenije za obdobje 2014–2020","004",20,"5.0.04.5","d",null,17,"01.4"]
["SA.53384 (2019/XA)","MKGP - prenos znanja v gozdarstvu - PRP (od 2019)",2399253000,"Prenos znanja in informiranja v gozdarskem sektorju, PRP 2014-2020 ","Uredba o ukrepih prenosa znanja in svetovanja iz Programa razvoja podeželja Republike Slovenije za obdobje 2014–2020","005",25,"5.0.05.3","e",null,18,"01.5"]
["SA.54634 (2019/XA)","MKGP - podlubniki (PRP) - od 2019 do 2020",2399253000,"Odprava škode v gozdovih zaradi napada prenamnoženih populacij podlubnikov kot posledica žledoloma – PRP 2014–2020 ","Uredba o ukrepih za sanacijo in obnovo gozda po naravni nesreči žledu med 30. januarjem in 10. februarjem 2014 iz Programa razvoja podeželja Republike Slovenije za obdobje 2014–2020","006",28,"5.0.05.4","f",null,19,"02.1"]
["SA.54635 (2019/XA)","MKGP - vetrolom 2018 (PRP)",2399253000,"Odprava škode v gozdovih zaradi vetroloma v letu 2018 iz PRP 2014–2020 ","Uredba o ukrepih za sanacijo in obnovo gozda po naravni nesreči vetrolomu iz Programa razvoja podeželja Republike Slovenije za obdobje 2014–2020","007",40,"5.0.06.0","g",null,20,"02.2"]
["SA.57337 (2020/XA)","MKGP - podlubniki (PRP) - od 2020",2399253000,"Odprava škode v gozdovih zaradi napada prenamnoženih populacij podlubnikov kot posledica žledoloma – PRP 2014–2020","Uredba o ukrepih za sanacijo in obnovo gozda po naravni nesreči žledu med 30. januarjem in 10. februarjem 2014 iz Programa razvoja podeželja Republike Slovenije za obdobje 2014–2020","008",43,"5.0.07.0","h",null,21,"03.1"]
["SA.57725 (2020/XA)","MKGP - naložbe ŽPI in gozdarstvo - PRP (MSP) - od 2020",2399253000,"Pomoč za naložbe v zvezi s predelavo kmetijskih proizvodov v nekmetijske proizvode in naložbe v gozdarski sektor –  PRP 2014–2020","Uredba o izvajanju ukrepa naložbe v osnovna sredstva in podukrepa podpora za naložbe v gozdarske tehnologije ter predelavo, mobilizacijo in trženje gozdarskih proizvodov iz Programa razvoja podeželja Republike Slovenije za obdobje 2014–2020","009",48,"5.0.10.0",null,null,22,"03.2"]
["SA.57725 (2020/XA)","MKGP - naložbe v gozdarstvo od 2020",2399253000,"Pomoč za naložbe v zvezi s predelavo kmetijskih proizvodov v nekmetijske proizvode in naložbe v gozdarski sektor –  PRP 2014–2020","Uredba o izvajanju ukrepa naložbe v osnovna sredstva in podukrepa podpora za naložbe v gozdarske tehnologije ter predelavo, mobilizacijo in trženje gozdarskih proizvodov iz Programa razvoja podeželja Republike Slovenije za obdobje 2014–2020","010",50,"5.0.11.2",null,null,23,"10.1"]
["SA.59150 (2020/N)","MKGP - naložbe ŽPI in gozdarstvo - PRP (velika podjetja) - od 2021",2399253000,"Pomoč za naložbe v zvezi s predelavo kmetijskih proizvodov v nekmetijske proizvode – velika podjetja – PRP 2014–2020","Uredba o izvajanju ukrepa naložbe v osnovna sredstva in podukrepa podpora za naložbe v gozdarske tehnologije ter predelavo, mobilizacijo in trženje gozdarskih proizvodov iz Programa razvoja podeželja Republike Slovenije za obdobje 2014–2020","011",70,"5.0.11.3",null,null,24,"10.3"]
["SA.62741 (2021/N)","MKGP - sofinanciranje reinjekcijskih vrtin",2399253000,"Sofinanciranje stroškov izdelave reinjekcijskih vrtin v kmetijski proizvodnji","Odlok o začasnem ukrepu sofinanciranja stroškov izdelave reinjekcijskih vrtin","012",75,"5.0.11.4",null,null,25,"10.4"]
["SA.64097 (2021/N)","MKGP - promocija sadja 2021-2023",2399253000,"Promocija in informiranje o kmetijskih proizvodih v sektorju sadja za obdobje 2021–2023","Odredba o Programu promocije sektorja sadja za obdobje 2021–2023","013",null,"5.0.11.5",null,null,26,"10.5"]
["SA.102674 (2022/N)","MKGP - promocija mesa 2023-2025",2399253000,"Promocija in informiranje o kmetijskih proizvodih v sektorju pridelave in predelave mesa za obdobje 2023–2025 ","Promocija in informiranje o kmetijskih proizvodih v sektorju pridelave in predelave mesa za obdobje 2023–2025","014",null,"5.0.11.6",null,null,"27(2)(a)","10.6"]
["SA.102922 (2022/N)","MKGP - promocija mleka 2023-2025",2399253000,"Promocija in informiranje o kmetijskih proizvodih v sektorju mleka za obdobje 2023–2025 ","Odredba o Programu promocije sektorja pridelave in predelave mleka za obdobje 2023–2025","015",null,"5.0.12.0",null,null,"27(2)(b)","10.8"]
["SA.106988","MKGP - protipožarna infrastruktura",2399253000,"Protipožarna infrastruktura – PRP 2014–2020","Uredba o izvajanju podukrepa podpora za preprečevanje škode v gozdovih zaradi gozdnih požarov ter naravnih nesreč in katastrofičnih dogodkov iz Programa razvoja podeželja Republike Slovenije za obdobje 2014–2020","016",null,"5.0.13.0",null,null,"27(2)(c)","10.9"]
["SA.107575 (2023/N)","MKGP - pomoč po suši 2022 za velika podjetja",2399253000,"Pomoč za odpravo posledic škode v kmetijstvu zaradi suše leta 2022","Program odprave posledic škode v kmetijstvu zaradi suše leta 2022","017",null,"5.0.14.1",null,null,"27(2)(d)","11.0"]
["SA.107776","MKGP - pomoč po suši 2022 za MSP",2399253000,"Pomoč za odpravo posledic škode v kmetijstvu zaradi suše leta 2022","Program odprave posledic škode v kmetijstvu zaradi suše leta 2022","018",null,"5.0.14.2",null,null,"27(2)(e)","16.1"]
["SA.108359 (2023/N)","MKGP - promocija sadja 2024-2026",2399253000,"Promocija in informiranje o kmetijskih proizvodih v sektorju sadja za obdobje 2024–2026","Odredba o Programu promocije sektorja pridelave in predelave sadja za obdobje 2024–2026","019",null,"5.0.14.3",null,null,"27(2)(f)","16.2"]
["SA.108530","UVHVVR - odstranitev in uničenje poginulih živali",2399253000,"Pomoč za kritje stroškov odstranitve in uničenja poginulih živali","Pravilnik o izvajanju javne veterinarske službe zbiranja, prevoza, skladiščenja in ravnanja z živalskimi trupli kot vrste živalskih stranskih proizvodov, ki niso namenjeni prehrani ljudi","020",null,"5.0.14.4",null,null,28,"46.1"]
["SA.108703 (2023/N)","MKGP - nadomestilo zaradi oviranega ribolova",2399253000,"Nadomestilo zaradi izpada dohodka zaradi oviranega gospodarskega ribolova","Zakon o ureditvi določenih vprašanj zaradi končne razsodbe arbitražnega sodišča na podlagi Arbitražnega sporazuma med Vlado Republike Slovenije in Vlado Republike Hrvaške","021",null,"5.0.15.0",null,null,29,"46.2"]
["SA.109125","UVHVVR - odškodnine za ZTR 2023-2026",2399253000,"Pomoč za odpravo škode zaradi zlate trsne rumenice v obdobju od 2023 do 2026 ","Uredba o ukrepih za zatiranje in preprečevanje širjenja zlate trsne rumenice","022",null,"5.1.01.0",null,null,30,"46.3"]
["SA.111030","MKGP - sofinanciranje zav. premij od 2023",2399253000,"Sofinanciranje zavarovalnih premij za zavarovanje primarne kmetijske proizvodnje ","Uredba o sofinanciranju zavarovalnih premij za zavarovanje primarne kmetijske proizvodnje","023",null,"5.1.02.0",null,null,31,"46.8"]
["SA.112957","MKGP - nadomestilo materialne škode zaradi poplav 2023",2399253000,"Pomoč za materialno škodo v primarni kmetijski proizvodnji zaradi poplav in zemeljskih plazov 4. avgusta 2023","Program za odpravo posledic škode v gospodarstvu, ki se nanaša na škodo v primarni kmetijski proizvodnji, zaradi poplav in zemeljskih plazov 4. avgusta 2023","024",null,"5.1.03.0",null,null,32,"46.9"]
["SA.113319","MKGP - gozdarske intervencije SN 23–27",2399253000,"Gozdarske intervencije SN 23–27","Uredba o izvajanju gozdarskih intervencij iz strateškega načrta Republike Slovenije za obdobje 2023–2027","025",null,"5.1.04.0",null,null,33,"47.1"]
["SA.114388","MKGP - dokončanje komasacijskih postopkov",2399253000,"Pomoč za dokončanje komasacijskih postopkov","Uredba o ukrepih kmetijske strukturne politike in kmetijske politike razvoja podeželja ","026",null,"5.1.05.0",null,null,34,"47.2"]
["SA.114660 (2024/N)","MKGP - pomoč velikim podjetjem po pozebi in neurjih 2023",2399253000,"Nadomestilo velikim podjetjem za škodo, povzročeno primarni kmetijski proizvodnji zaradi pozebe in toče v letu 2023","Program odprave posledic škode v kmetijstvu zaradi pozebe od 3. do 7. aprila 2023, neurij s točo od 10. maja do 1. avgusta 2023 in poplav od 3. do 6. avgusta in od 28. do 31. avgusta 2023","027",null,"5.1.06.0",null,null,35]
["SA.115114","MKGP - pomoč po pozebi in neurjih 2023",2399253000,"Pomoč za škodo v primarni kmetijski proizvodnji zaradi pozebe in neurij s točo leta 2023","Program odprave posledic škode v kmetijstvu zaradi pozebe od 3. do 7. aprila 2023, neurij s točo od 10. maja do 1. avgusta 2023 in poplav od 3. do 6. avgusta in od 28. do 31. avgusta 2023","028",null,"5.2.01.0",null,null,36]
["SA.115117","MKGP - pomoč po poplavah 2023",2399253000,"Pomoč za odpravo posledic škode kmetijstvu zaradi poplav avgusta 2023","Program odprave posledic škode v kmetijstvu zaradi pozebe od 3. do 7. aprila 2023, neurij s točo od 10. maja do 1. avgusta 2023 in poplav od 3. do 6. avgusta in od 28. do 31. avgusta 2023","029",null,"5.2.02.0",null,null,37]
{"$rows_left_out":183}