{"text_format":"1","workbook":"xlsx","n_sheets":2,"sheets":["Poročilo o dodeljenih DP","Kode"],"not_rendered":{"charts":0,"images":0,"macros":1,"external_links":0,"defined_names":0,"comments":1,"pivot_tables":0},"unopened":[],"bounds":{"document_bytes":16777216,"sheet_cells":100000,"rows_first":2000,"rows_last":500,"rows_between":2000,"halvings":0,"cell_chars":16384,"cell_head_chars":4096},"cells_cut":0,"cells_raw":0,"read":"whole","date_system":"1900"}

{"sheet":"Poročilo o dodeljenih DP","index":0,"n_rows":205,"n_cols":25,"rows_kept":205,"cut":false,"hidden":false,"merged":[]}
["Naziv dajalca pomoči","Matična številka dajalca pomoči","Evropska identifikacijska številka sheme državne pomoči","Naziv sheme državne pomoči","Matična številka prejemnika","Ime in priimek prejemnika ali naziv pravne osebe, ki je prejela pomoč","Davčna št.  prejemnika","KMG-MID-številka prejemnika","Naslov prejemnika (ime ulice in hišna številka, poštna številka in naziv pošte)","Šifra občine prejemnika","Datum odobritve pomoči","Datum nakazila pomoči prejemniku","Šifra instrumenta pomoči","Šifra namena pomoči","Opis ukrepa","Naložba\n(da/ne)","Vrednost celotne naložbe (EUR)","Pravna podlaga za odobritev pomoči","Pravni akt","Znesek upravičenih stroškov (EUR)","Bruto znesek pomoči \n(EUR)","Neto znesek \npomoči (EUR)","Število udeležencev","Člen Uredbe EU št. 702/2014","Stopnja intenzivnosti pomoči (%)"]
[null,{"$f":"LOOKUP(A2,Kode!A2:A216,Kode!B2:B216)","v":{"$error":"#N/A"}},{"$f":"LOOKUP(A2,Kode!A2:A216,Kode!C2:C216)","v":{"$error":"#N/A"}},{"$f":"LOOKUP(A2,Kode!A2:A216,Kode!D2:D216)","v":{"$error":"#N/A"}},null,null,null,null,null,null,null,null,null,null,null,null,null,{"$f":"LOOKUP(A2,Kode!A2:A216,Kode!E2:E216)","v":{"$error":"#N/A"}},null,null,null,null,null,null,{"$f":"V2/T2*100","v":{"$error":"#DIV/0!"}}]
[null,{"$f":"LOOKUP(A3,Kode!A2:A216,Kode!B2:B216)","v":{"$error":"#N/A"}},{"$f":"LOOKUP(A3,Kode!A2:A216,Kode!C2:C216)","v":{"$error":"#N/A"}},{"$f":"LOOKUP(A3,Kode!A2:A216,Kode!D2:D216)","v":{"$error":"#N/A"}},null,null,null,null,null,null,null,null,null,null,null,null,null,{"$f":"LOOKUP(A3,Kode!A2:A216,Kode!E2:E216)","v":{"$error":"#N/A"}},null,null,null,null,null,null,{"$f":"V3/T3*100","v":{"$error":"#DIV/0!"}}]
[null,{"$f":"LOOKUP(A4,Kode!A2:A216,Kode!B2:B216)","v":{"$error":"#N/A"}},{"$f":"LOOKUP(A4,Kode!A2:A216,Kode!C2:C216)","v":{"$error":"#N/A"}},{"$f":"LOOKUP(A4,Kode!A2:A216,Kode!D2:D216)","v":{"$error":"#N/A"}},null,null,null,null,null,null,null,null,null,null,null,null,null,{"$f":"LOOKUP(A4,Kode!A2:A216,Kode!E2:E216)","v":{"$error":"#N/A"}},null,null,null,null,null,null,{"$error":"#DIV/0!"}]
[null,{"$f":"LOOKUP(A5,Kode!A2:A216,Kode!B2:B216)","v":{"$error":"#N/A"}},{"$f":"LOOKUP(A5,Kode!A2:A216,Kode!C2:C216)","v":{"$error":"#N/A"}},{"$f":"LOOKUP(A5,Kode!A2:A216,Kode!D2:D216)","v":{"$error":"#N/A"}},null,null,null,null,null,null,null,null,null,null,null,null,null,{"$f":"LOOKUP(A5,Kode!A2:A216,Kode!E2:E216)","v":{"$error":"#N/A"}},null,null,null,null,null,null,{"$error":"#DIV/0!"}]
[null,{"$f":"LOOKUP(A6,Kode!A2:A216,Kode!B2:B216)","v":{"$error":"#N/A"}},{"$f":"LOOKUP(A6,Kode!A2:A216,Kode!C2:C216)","v":{"$error":"#N/A"}},{"$f":"LOOKUP(A6,Kode!A2:A216,Kode!D2:D216)","v":{"$error":"#N/A"}},null,null,null,null,null,null,null,null,null,null,null,null,null,{"$f":"LOOKUP(A6,Kode!A2:A216,Kode!E2:E216)","v":{"$error":"#N/A"}},null,null,null,null,null,null,{"$error":"#DIV/0!"}]
[null,{"$f":"LOOKUP(A7,Kode!A2:A216,Kode!B2:B216)","v":{"$error":"#N/A"}},{"$f":"LOOKUP(A7,Kode!A2:A216,Kode!C2:C216)","v":{"$error":"#N/A"}},{"$f":"LOOKUP(A7,Kode!A2:A216,Kode!D2:D216)","v":{"$error":"#N/A"}},null,null,null,null,null,null,null,null,null,null,null,null,null,{"$f":"LOOKUP(A7,Kode!A2:A216,Kode!E2:E216)","v":{"$error":"#N/A"}},null,null,null,null,null,null,{"$error":"#DIV/0!"}]
[null,{"$f":"LOOKUP(A8,Kode!A2:A216,Kode!B2:B216)","v":{"$error":"#N/A"}},{"$f":"LOOKUP(A8,Kode!A2:A216,Kode!C2:C216)","v":{"$error":"#N/A"}},{"$f":"LOOKUP(A8,Kode!A2:A216,Kode!D2:D216)","v":{"$error":"#N/A"}},null,null,null,null,null,null,null,null,null,null,null,null,null,{"$f":"LOOKUP(A8,Kode!A2:A216,Kode!E2:E216)","v":{"$error":"#N/A"}},null,null,null,null,null,null,{"$error":"#DIV/0!"}]
[null,{"$f":"LOOKUP(A9,Kode!A2:A216,Kode!B2:B216)","v":{"$error":"#N/A"}},{"$f":"LOOKUP(A9,Kode!A2:A216,Kode!C2:C216)","v":{"$error":"#N/A"}},{"$f":"LOOKUP(A9,Kode!A2:A216,Kode!D2:D216)","v":{"$error":"#N/A"}},null,null,null,null,null,null,null,null,null,null,null,null,null,{"$f":"LOOKUP(A9,Kode!A2:A216,Kode!E2:E216)","v":{"$error":"#N/A"}},null,null,null,null,null,null,{"$error":"#DIV/0!"}]
[null,{"$f":"LOOKUP(A10,Kode!A2:A216,Kode!B2:B216)","v":{"$error":"#N/A"}},{"$f":"LOOKUP(A10,Kode!A2:A216,Kode!C2:C216)","v":{"$error":"#N/A"}},{"$f":"LOOKUP(A10,Kode!A2:A216,Kode!D2:D216)","v":{"$error":"#N/A"}},null,null,null,null,null,null,null,null,null,null,null,null,null,{"$f":"LOOKUP(A10,Kode!A2:A216,Kode!E2:E216)","v":{"$error":"#N/A"}},null,null,null,null,null,null,{"$error":"#DIV/0!"}]
[null,{"$f":"LOOKUP(A11,Kode!A2:A216,Kode!B2:B216)","v":{"$error":"#N/A"}},{"$f":"LOOKUP(A11,Kode!A2:A216,Kode!C2:C216)","v":{"$error":"#N/A"}},{"$f":"LOOKUP(A11,Kode!A2:A216,Kode!D2:D216)","v":{"$error":"#N/A"}},null,null,null,null,null,null,null,null,null,null,null,null,null,{"$f":"LOOKUP(A11,Kode!A2:A216,Kode!E2:E216)","v":{"$error":"#N/A"}},null,null,null,null,null,null,{"$error":"#DIV/0!"}]
[null,{"$f":"LOOKUP(A12,Kode!A2:A216,Kode!B2:B216)","v":{"$error":"#N/A"}},{"$f":"LOOKUP(A12,Kode!A2:A216,Kode!C2:C216)","v":{"$error":"#N/A"}},{"$f":"LOOKUP(A12,Kode!A2:A216,Kode!D2:D216)","v":{"$error":"#N/A"}},null,null,null,null,null,null,null,null,null,null,null,null,null,{"$f":"LOOKUP(A12,Kode!A2:A216,Kode!E2:E216)","v":{"$error":"#N/A"}},null,null,null,null,null,null,{"$error":"#DIV/0!"}]
[null,{"$f":"LOOKUP(A13,Kode!A2:A216,Kode!B2:B216)","v":{"$error":"#N/A"}},{"$f":"LOOKUP(A13,Kode!A2:A216,Kode!C2:C216)","v":{"$error":"#N/A"}},{"$f":"LOOKUP(A13,Kode!A2:A216,Kode!D2:D216)","v":{"$error":"#N/A"}},null,null,null,null,null,null,null,null,null,null,null,null,null,{"$f":"LOOKUP(A13,Kode!A2:A216,Kode!E2:E216)","v":{"$error":"#N/A"}},null,null,null,null,null,null,{"$error":"#DIV/0!"}]
[null,{"$f":"LOOKUP(A14,Kode!A2:A216,Kode!B2:B216)","v":{"$error":"#N/A"}},{"$f":"LOOKUP(A14,Kode!A2:A216,Kode!C2:C216)","v":{"$error":"#N/A"}},{"$f":"LOOKUP(A14,Kode!A2:A216,Kode!D2:D216)","v":{"$error":"#N/A"}},null,null,null,null,null,null,null,null,null,null,null,null,null,{"$f":"LOOKUP(A14,Kode!A2:A216,Kode!E2:E216)","v":{"$error":"#N/A"}},null,null,null,null,null,null,{"$error":"#DIV/0!"}]
[null,{"$f":"LOOKUP(A15,Kode!A2:A216,Kode!B2:B216)","v":{"$error":"#N/A"}},{"$f":"LOOKUP(A15,Kode!A2:A216,Kode!C2:C216)","v":{"$error":"#N/A"}},{"$f":"LOOKUP(A15,Kode!A2:A216,Kode!D2:D216)","v":{"$error":"#N/A"}},null,null,null,null,null,null,null,null,null,null,null,null,null,{"$f":"LOOKUP(A15,Kode!A2:A216,Kode!E2:E216)","v":{"$error":"#N/A"}},null,null,null,null,null,null,{"$error":"#DIV/0!"}]
[null,{"$f":"LOOKUP(A16,Kode!A2:A216,Kode!B2:B216)","v":{"$error":"#N/A"}},{"$f":"LOOKUP(A16,Kode!A2:A216,Kode!C2:C216)","v":{"$error":"#N/A"}},{"$f":"LOOKUP(A16,Kode!A2:A216,Kode!D2:D216)","v":{"$error":"#N/A"}},null,null,null,null,null,null,null,null,null,null,null,null,null,{"$f":"LOOKUP(A16,Kode!A2:A216,Kode!E2:E216)","v":{"$error":"#N/A"}},null,null,null,null,null,null,{"$error":"#DIV/0!"}]
[null,{"$f":"LOOKUP(A17,Kode!A2:A216,Kode!B2:B216)","v":{"$error":"#N/A"}},{"$f":"LOOKUP(A17,Kode!A2:A216,Kode!C2:C216)","v":{"$error":"#N/A"}},{"$f":"LOOKUP(A17,Kode!A2:A216,Kode!D2:D216)","v":{"$error":"#N/A"}},null,null,null,null,null,null,null,null,null,null,null,null,null,{"$f":"LOOKUP(A17,Kode!A2:A216,Kode!E2:E216)","v":{"$error":"#N/A"}},null,null,null,null,null,null,{"$error":"#DIV/0!"}]
[null,{"$f":"LOOKUP(A18,Kode!A2:A216,Kode!B2:B216)","v":{"$error":"#N/A"}},{"$f":"LOOKUP(A18,Kode!A2:A216,Kode!C2:C216)","v":{"$error":"#N/A"}},{"$f":"LOOKUP(A18,Kode!A2:A216,Kode!D2:D216)","v":{"$error":"#N/A"}},null,null,null,null,null,null,null,null,null,null,null,null,null,{"$f":"LOOKUP(A18,Kode!A2:A216,Kode!E2:E216)","v":{"$error":"#N/A"}},null,null,null,null,null,null,{"$error":"#DIV/0!"}]
[null,{"$f":"LOOKUP(A19,Kode!A2:A216,Kode!B2:B216)","v":{"$error":"#N/A"}},{"$f":"LOOKUP(A19,Kode!A2:A216,Kode!C2:C216)","v":{"$error":"#N/A"}},{"$f":"LOOKUP(A19,Kode!A2:A216,Kode!D2:D216)","v":{"$error":"#N/A"}},null,null,null,null,null,null,null,null,null,null,null,null,null,{"$f":"LOOKUP(A19,Kode!A2:A216,Kode!E2:E216)","v":{"$error":"#N/A"}},null,null,null,null,null,null,{"$error":"#DIV/0!"}]
[null,{"$f":"LOOKUP(A20,Kode!A2:A216,Kode!B2:B216)","v":{"$error":"#N/A"}},{"$f":"LOOKUP(A20,Kode!A2:A216,Kode!C2:C216)","v":{"$error":"#N/A"}},{"$f":"LOOKUP(A20,Kode!A2:A216,Kode!D2:D216)","v":{"$error":"#N/A"}},null,null,null,null,null,null,null,null,null,null,null,null,null,{"$f":"LOOKUP(A20,Kode!A2:A216,Kode!E2:E216)","v":{"$error":"#N/A"}},null,null,null,null,null,null,{"$error":"#DIV/0!"}]
[null,{"$f":"LOOKUP(A21,Kode!A2:A216,Kode!B2:B216)","v":{"$error":"#N/A"}},{"$f":"LOOKUP(A21,Kode!A2:A216,Kode!C2:C216)","v":{"$error":"#N/A"}},{"$f":"LOOKUP(A21,Kode!A2:A216,Kode!D2:D216)","v":{"$error":"#N/A"}},null,null,null,null,null,null,null,null,null,null,null,null,null,{"$f":"LOOKUP(A21,Kode!A2:A216,Kode!E2:E216)","v":{"$error":"#N/A"}},null,null,null,null,null,null,{"$error":"#DIV/0!"}]
[null,{"$f":"LOOKUP(A22,Kode!A2:A216,Kode!B2:B216)","v":{"$error":"#N/A"}},{"$f":"LOOKUP(A22,Kode!A2:A216,Kode!C2:C216)","v":{"$error":"#N/A"}},{"$f":"LOOKUP(A22,Kode!A2:A216,Kode!D2:D216)","v":{"$error":"#N/A"}},null,null,null,null,null,null,null,null,null,null,null,null,null,{"$f":"LOOKUP(A22,Kode!A2:A216,Kode!E2:E216)","v":{"$error":"#N/A"}},null,null,null,null,null,null,{"$error":"#DIV/0!"}]
[null,{"$f":"LOOKUP(A23,Kode!A2:A216,Kode!B2:B216)","v":{"$error":"#N/A"}},{"$f":"LOOKUP(A23,Kode!A2:A216,Kode!C2:C216)","v":{"$error":"#N/A"}},{"$f":"LOOKUP(A23,Kode!A2:A216,Kode!D2:D216)","v":{"$error":"#N/A"}},null,null,null,null,null,null,null,null,null,null,null,null,null,{"$f":"LOOKUP(A23,Kode!A2:A216,Kode!E2:E216)","v":{"$error":"#N/A"}},null,null,null,null,null,null,{"$error":"#DIV/0!"}]
[null,{"$f":"LOOKUP(A24,Kode!A2:A216,Kode!B2:B216)","v":{"$error":"#N/A"}},{"$f":"LOOKUP(A24,Kode!A2:A216,Kode!C2:C216)","v":{"$error":"#N/A"}},{"$f":"LOOKUP(A24,Kode!A2:A216,Kode!D2:D216)","v":{"$error":"#N/A"}},null,null,null,null,null,null,null,null,null,null,null,null,null,{"$f":"LOOKUP(A24,Kode!A2:A216,Kode!E2:E216)","v":{"$error":"#N/A"}},null,null,null,null,null,null,{"$error":"#DIV/0!"}]
[null,{"$f":"LOOKUP(A25,Kode!A2:A216,Kode!B2:B216)","v":{"$error":"#N/A"}},{"$f":"LOOKUP(A25,Kode!A2:A216,Kode!C2:C216)","v":{"$error":"#N/A"}},{"$f":"LOOKUP(A25,Kode!A2:A216,Kode!D2:D216)","v":{"$error":"#N/A"}},null,null,null,null,null,null,null,null,null,null,null,null,null,{"$f":"LOOKUP(A25,Kode!A2:A216,Kode!E2:E216)","v":{"$error":"#N/A"}},null,null,null,null,null,null,{"$error":"#DIV/0!"}]
[null,{"$f":"LOOKUP(A26,Kode!A2:A216,Kode!B2:B216)","v":{"$error":"#N/A"}},{"$f":"LOOKUP(A26,Kode!A2:A216,Kode!C2:C216)","v":{"$error":"#N/A"}},{"$f":"LOOKUP(A26,Kode!A2:A216,Kode!D2:D216)","v":{"$error":"#N/A"}},null,null,null,null,null,null,null,null,null,null,null,null,null,{"$f":"LOOKUP(A26,Kode!A2:A216,Kode!E2:E216)","v":{"$error":"#N/A"}},null,null,null,null,null,null,{"$error":"#DIV/0!"}]
[null,{"$f":"LOOKUP(A27,Kode!A2:A216,Kode!B2:B216)","v":{"$error":"#N/A"}},{"$f":"LOOKUP(A27,Kode!A2:A216,Kode!C2:C216)","v":{"$error":"#N/A"}},{"$f":"LOOKUP(A27,Kode!A2:A216,Kode!D2:D216)","v":{"$error":"#N/A"}},null,null,null,null,null,null,null,null,null,null,null,null,null,{"$f":"LOOKUP(A27,Kode!A2:A216,Kode!E2:E216)","v":{"$error":"#N/A"}},null,null,null,null,null,null,{"$error":"#DIV/0!"}]
[null,{"$f":"LOOKUP(A28,Kode!A2:A216,Kode!B2:B216)","v":{"$error":"#N/A"}},{"$f":"LOOKUP(A28,Kode!A2:A216,Kode!C2:C216)","v":{"$error":"#N/A"}},{"$f":"LOOKUP(A28,Kode!A2:A216,Kode!D2:D216)","v":{"$error":"#N/A"}},null,null,null,null,null,null,null,null,null,null,null,null,null,{"$f":"LOOKUP(A28,Kode!A2:A216,Kode!E2:E216)","v":{"$error":"#N/A"}},null,null,null,null,null,null,{"$error":"#DIV/0!"}]
[null,{"$f":"LOOKUP(A29,Kode!A2:A216,Kode!B2:B216)","v":{"$error":"#N/A"}},{"$f":"LOOKUP(A29,Kode!A2:A216,Kode!C2:C216)","v":{"$error":"#N/A"}},{"$f":"LOOKUP(A29,Kode!A2:A216,Kode!D2:D216)","v":{"$error":"#N/A"}},null,null,null,null,null,null,null,null,null,null,null,null,null,{"$f":"LOOKUP(A29,Kode!A2:A216,Kode!E2:E216)","v":{"$error":"#N/A"}},null,null,null,null,null,null,{"$error":"#DIV/0!"}]
[null,{"$f":"LOOKUP(A30,Kode!A2:A216,Kode!B2:B216)","v":{"$error":"#N/A"}},{"$f":"LOOKUP(A30,Kode!A2:A216,Kode!C2:C216)","v":{"$error":"#N/A"}},{"$f":"LOOKUP(A30,Kode!A2:A216,Kode!D2:D216)","v":{"$error":"#N/A"}},null,null,null,null,null,null,null,null,null,null,null,null,null,{"$f":"LOOKUP(A30,Kode!A2:A216,Kode!E2:E216)","v":{"$error":"#N/A"}},null,null,null,null,null,null,{"$error":"#DIV/0!"}]
{"$rows_left_out":176}
{"sheet":"Kode","index":1,"n_rows":432,"n_cols":11,"rows_kept":432,"cut":false,"hidden":true,"merged":[]}
["Naziv dajalca pomoči","MŠ dajalca pomoči","ID sheme pomoči","Naziv sheme pomoči","Pravna podlaga sheme pomoči","Šifra občine","Šifra instrumenta","Šifra namena","Opis ukrepa","Investicija","Člen uredbe"]
["Javni sklad malega gospodarstva Goriške",5628849000,"SA.44143(2016/XA)","Finančne spodbude JSMGG  v kmetijskem sektorju  za obdobje 2016-2020","Splošni pogoji poslovanja Javnega sklada malega gospodarstva Goriške za kmetijstvo v programskem obdobju 2015–2020",null,1,"5.0.04.1","a","da",14]
["Javni sklad Republike Slovenije za regionalni razvoj in razvoj podeželja",5940117000,"SA.41608(2015/XA)","Spodbude sklada za naložbe na področjih primarne kmetijske pridelave, predelave in trženja kmetijskih proizvodov ter ohranjanja kulturne in naravne dediščine","Pravilnik o dodeljevanju spodbud",null,5,"5.0.04.2","b","ne",15]
["Magyar Regionális Nemzetiségi Fejlesztési Intézet Lendva - Zavod za regionalni razvoj madžarske narodnosti Lendava",7198337000,"SA.54721(2019/XA)","Shema državne pomoči za ohranjanje in spodbujanje razvoja kmetijstva na območjih občin, v katerih živi avtohtona madžarska narodna skupnost, za programsko obdobje 2019–2020","Pravilnik o ohranjanju in spodbujanju razvoja kmetijstva na območju občin, v katerih živi avtohtona madžarska narodna skupnost za programsko obdobje 2017–2020",null,10,"5.0.04.4","c",null,16]
["Mestna občina Celje",5880360000,"SA.43312(2015/XA)","Ukrepi v podporo ohranjanju in spodbujanju razvoja podeželja v Mestni občini Celje za programsko obdobje 2015 – 2020","Pravilnik o ohranjanju in spodbujanju razvoja kmetijstva in podeželja v Mestni občini Celje za programsko obdobje 2015–2020","011",20,"5.0.04.5","d",null,17]
["Mestna občina Koper",5874424000,"SA.43290(2015/XA)","Ukrepi v podporo ohranjanju in spodbujanju razvoja kmetijstva in podeželja v Mestni občini Koper za programsko obdobje 2015-2020","Pravilnik o ohranjanju in spodbujanju razvoja kmetijstva in podeželja v Mestni občini Koper za programsko obdobje 2015-2020","050",25,"5.0.07.0","e",null,21]
["Mestna občina Kranj",5874653000,"SA.42434(2015/XA)","Podpore za ohranjanje in razvoj kmetijstva v Mestni občini Kranj za leta 2015 – 2020","Pravilnik o dodelitvi pomoči za ohranjanje in spodbujanje razvoja kmetijstva, gozdarstva in podeželja v Mestni občini Kranj za programsko obdobje 2015 – 2020","052",28,"5.0.10.0","f",null,24]
["Mestna občina Ljubljana",5874025000,"SA.41984(2015/XA)","Podpora ukrepom razvoja podeželja v Mestni občini Ljubljana 2015-2020","Pravilnik o ukrepih za razvoj podeželja v Mestni občini Ljubljana za programsko obdobje 2015–2020","061",40,"5.0.11.2","g",null,28]
["Mestna občina Maribor",5883369000,"SA.44883(2016/XA)","Podpore za ohranjanje in spodbujanje razvoja kmetijstva in podeželja v Mestni občini Maribor za programsko obdobje 2016 - 2020","Pravilnik  o ohranjanju in spodbujanju razvoja kmetijstva in podeželja v Mestni občini Maribor za programsko obdobje 2016 – 2020","070",43,"5.0.11.3","h",null,29]
["Mestna občina Murska Sobota",5883172000,"ni priglašene sheme","ni priglašene sheme","ni priglašene sheme","080",48,"5.0.11.4",null,null,38]
["Mestna občina Nova Gorica",5881773000,"SA.43223(2015/XA)","Podpore programom razvoja kmetijstva in podeželja v Mestni občini Nova  Gorica za obdobje 2015-2020","Odlok o ohranjanju in spodbujanju razvoja kmetijstva in podeželja v Mestni občini Nova Gorica za programsko obdobje 2015–2020","084",50,"5.0.11.5",null,null,43]
["Mestna občina Novo mesto",5883288000,"SA.41983(2015/XA","Ukrepi v podporo ohranjanju in spodbujanju razvoja kmetijstva in podeželja v Mestni občini Novo mesto za programsko obdobje 2015 – 2020","Pravilnik o ohranjanju in spodbujanju razvoja kmetijstva in podeželja v Mestni občini Novo mesto za programsko obdobje 2015 - 2020","085",70,"5.0.12.0"]
["Mestna občina Ptuj",5883598000,"SA.42978(2015/XA)","Dodeljevanje državnih in drugih pomoči, ter ukrepov za programe razvoja podeželja v Mestni občini Ptuj","Pravilnik o dodeljevanju državnih in drugih pomoči, ter ukrepov za programe razvoja podeželja v Mestni občini Ptuj","096",75,"5.0.13.0"]
["Mestna občina Slovenj Gradec",5883903000,"SA.42714(2015/XA) ","Podpore za ohranjanje in razvoj kmetijstva v Mestni občini Slovenj Gradec za leta 2015-2020","Pravilnik o ohranjanju in spodbujanju razvoja kmetijstva v Mestni občini Slovenj Gradec za programsko obdobje 2015-2020","112",null,"5.0.14.1"]
["Mestna občina Velenje",5884268000,"SA.42506(2015/XA)","Ohranjanje in razvoj kmetijstva in podeželja v Mestni občini Velenje za programsko obdobje 2015 - 2020","Pravilnik o dodeljevanju pomoči za ohranjanje in razvoj kmetijstva in podeželja v Mestni občini Velenje za programsko obdobje  2015 – 2020","133",null,"5.0.14.2"]
["Občina Ajdovščina",5879914000,"SA.44056(2016/XA)","Ohranjanje in spodbujanje razvoja kmetijstva in podeželja v občini Ajdovščina","Pravilnik o ohranjanju in spodbujanju razvoja kmetijstva in podeželja v Občini Ajdovščina za programsko obdobje 2015–2020","001",null,"5.0.14.3"]
["Občina Ankaran",2482851000,null,null,null,"213",null,"5.0.14.4"]
["Občina Apače",2215632000,"SA.55713(2019/XA)","Podpore za ohranjanje in spodbujanje razvoja kmetijstva in podeželja v Občini Apače za programsko obdobje od 2019 do 2020","Pravilnik o ohranjanju in spodbujanju razvoja kmetijstva in podeželja v Občini Apače za programsko obdobje 2015 - 2020","195",null,"5.0.15.0"]
["Občina Beltinci",5883016000,"SA.43241(2015/XA)","Podpora programom ohranjanja in spodbujanja razvoja kmetijstva in podeželja v Občini Beltinci za programsko obdobje 2015-2020","Pravilnik o ohranjanju in spodbujanju razvoja kmetijstva in podeželja v Občini Beltinci za programsko obdobje 2015–2020","002",null,"5.1.01.0"]
["Občina Benedikt",1332139000,"ni priglašene sheme","ni priglašene sheme","ni priglašene sheme","148",null,"5.1.02.0"]
["Občina Bistrica ob Sotli",1357450000,"SA.43154(2015/XA) ","Podpore za ohranjanje in razvoj kmetijstva in podeželja v Občini Bistrica ob Sotli za  leta 2015-2020","Pravilnik o ohranjanju in spodbujanju razvoja kmetijstva in podeželja v Občini Bistrica ob Sotli za programsko obdobje 2015–2020","149",null,"5.1.03.0"]
["Občina Bled",5883539000,"SA.43222(2015/XA)","Podpore programom razvoja podeželja v Občini Bled 2015 - 2020","Pravilnik o ohranjanju in spodbujanju razvoja kmetijstva in podeželja v Občini Bled za programsko obdobje 2015 - 2020","003",null,"5.1.04.0"]
["Občina Bloke",1358456000,"SA.43760(2015/XA)","Pomoč za zaokrožitev kmetijskih in gozdnih zemljišč","Pravilnik o ohranjanju in spodbujanju razvoja kmetijstva in podeželja v občini Bloke za programsko obdobje 2015-2020","150",null,"5.1.05.0"]
["Občina Bohinj",5883415000,"SA.44882(2016/XA)","Pomoči za ohranjanje in spodbujanje razvoja kmetijstva in podeželja v občini Bohinj za programsko obdobje 2015 - 2020","Pravilnik o ohranjanju in spodbujanju razvoja  kmetijstva in podeželja v občini Bohinj za programsko obdobje 2015-2020","004",null,"5.1.06.0"]
["Občina Borovnica",5883393000,"SA.45583(2016/XA)"," Podpora za ohranjanje in spodbujanje razvoja kmetijstva v občini Borovnica za programsko obdobje 2016-2020","Pravilnik o ohranjanju in spodbujanju razvoja kmetijstva in podeželja v Občini Borovnica za programsko obdobje 2016-2020","005",null,"5.2.01.0"]
["Občina Bovec",5881498000,"SA.42059(2015/XA)","Finančne intervencije za ohranjanje in spodbujanje razvoja kmetijstva in podeželja v občini Bovec ","Pravilnik o ohranjanju in spodbujanju razvoja kmetijstva in podeželja v občini Bovec za programsko obdobje 2015-2020","006",null,"5.2.02.0"]
["Občina Braslovče",1357557000,"SA.55366(2019/XA)","Spodbujanje razvoja kmetijstva in podeželja v Občini Braslovče za obdobje 2019–2020","Pravilnik o ohranjanju in spodbujanju razvoja kmetijstva in podeželja v Občini Braslovče za programsko obdobje 2019– 2020","151",null,"5.7.00.0"]
["Občina Brda",5881781000,"ni priglašene sheme","ni priglašene sheme","ni priglašene sheme","007",null,"5.8.01.0"]
["Občina Brezovica",5874971000,"SA.49080(2017/XA)","Podpore za ohranjanje in razvoj kmetijstva in podeželja v občini Brezovica 2017-2020","Pravilnik o ohranjanju in spodbujanju razvoja kmetijstva in podeželja v Občini Brezovica za programsko obdobje 2017–2020","008",null,"5.8.02.0"]
["Občina Brežice",5880173000,"SA.42109(2015/XA)","Pomoč za ohranjanje in spodbujanje kmetijstva in podeželja v občini Brežice za programsko obdobje 2015-2020","Pravilnik o ohranjanju in spodbujanju razvoja kmetijstva in podeželja v Občini Brežice za programsko obdobje 2015–2020","009",null,"5.8.03.0"]
{"$rows_left_out":402}